{"text_format":"1","workbook":"xlsx","n_sheets":9,"sheets":["home","Istruzioni","Parametri","Acidi & concimi","Formule nutritive","Calcolo","Stampa","Test precipitazioni","Convertitore"],"not_rendered":{"charts":0,"images":15,"macros":1,"external_links":1,"defined_names":13,"comments":6,"pivot_tables":0},"unopened":[],"bounds":{"document_bytes":16777216,"sheet_cells":100000,"rows_first":2000,"rows_last":500,"rows_between":2000,"halvings":0,"cell_chars":16384,"cell_head_chars":4096},"cells_cut":0,"cells_raw":0,"read":"whole","date_system":"1900"}

{"sheet":"home","index":0,"n_rows":14,"n_cols":11,"rows_kept":14,"cut":false,"hidden":false,"merged":[[20,1,20,10],[18,1,18,10],[17,1,17,10],[3,2,3,5],[5,1,5,10],[9,1,9,7],[14,1,14,10],[15,1,15,10],[16,1,16,10],[7,1,7,9],[8,10,8,11],[11,1,11,9],[13,2,13,11],[19,1,19,10]]}
[]
[null,null,"CALCULADORA DE SOLUCION NUTRITIVAS (SN)"]
[]
[]
[]
[null,"Acerca de este software"]
[]
[null,"La calculadora de Soluciones Nutritivas (SN) es una hoja de cálculo EXCEL™ que ha sido desarrollada por el Dr. Incrocci (Dipartimento di Biologia delle Piante Agrarie, University of Pisa) para asistir a productores y técnicos en el cálculo de la concentración salina de las soluciones madre. La traducción al Español fue realizada por el Dr. Miguel Giménez Moolhuyzen (IFAPA Almería, España)."]
[null,null,null,null,null,null,null,null,null,null,"Inicio >>"]
[null,"Términos y condiciones de uso de software"]
[]
[null,"Esta herramienta informática (software) está disponible libre de cargo. No se permiten su uso comercial, reproducción o distribución. Los autores de este software no son responsables de cualquier tipo de daños y perjuicios causados por el uso del software. La totalidad del riesgo respecto a los usos, análisis, resultados y rendimientos del software es asumida por el usuario. El usuario exime a los creadores de cualquier responsabilidad, expresa o implícita, que se deriven de la aplicación de dicho software."]
[]
[null,null,"Agradecimientos:\nEUPHOROS, \"Efficient use of inputs in protected horticulture\", EU-FP7-KBBE-2007-1 (grant n° 211457)\n"]

{"sheet":"Istruzioni","index":1,"n_rows":32,"n_cols":8,"rows_kept":32,"cut":false,"hidden":false,"merged":[[67,1,67,10],[69,1,69,10],[14,1,14,10],[60,1,60,10],[61,1,61,10],[62,1,62,10],[68,1,68,10],[63,1,63,10],[64,1,64,10],[65,1,65,10],[66,1,66,10],[48,1,48,10],[49,1,49,10],[50,1,50,10],[51,1,51,10],[57,1,57,9],[56,1,56,10],[58,1,58,10],[59,1,59,10],[54,1,54,9],[41,1,41,10],[52,1,52,10],[53,1,53,10],[55,1,55,10],[44,1,44,10],[45,1,45,10],[46,1,46,10],[47,1,47,10],[70,1,70,10],[27,1,27,10],[33,1,33,10],[29,1,29,10],[30,1,30,10],[32,1,32,10],[31,2,31,11],[36,1,36,10],[37,1,37,10],[34,1,34,10],[42,1,42,10],[35,1,35,10],[43,1,43,10],[38,1,38,10],[39,1,39,10],[40,1,40,10],[24,1,24,10],[28,1,28,10],[15,1,15,10],[16,1,16,10],[17,1,17,10],[19,1,19,10],[21,1,21,10],[22,1,22,10],[23,1,23,10],[25,1,25,10],[26,1,26,10],[20,1,20,10],[10,1,10,10],[11,1,11,10],[12,1,12,10],[3,2,3,5],[3,7,3,10],[5,2,5,5],[5,7,5,10],[7,2,7,5],[7,7,7,10]]}
[]
[null,null,"CALCULADORA DE SOLUCION NUTRITIVAS (SN)"]
[]
[null,null,"Entrada",null,null,null,null,"Conversor de unidades (ppm>mM)"]
[]
[null,null,"Soluciones nutritivas",null,null,null,null,"Fertilizantes y ácidos"]
[]
[null,null,"Informe",null,null,null,null,"Cálculo"]
[]
[]
[null,"Calculadora SN V1.2” GUIA RAPIDA DE INICIO"]
[null,"Luca INCROCCI, Universidad de Pisa, Italia."]
[]
[]
[]
[]
[]
[]
[]
[]
[]
[]
[]
[]
[]
[]
[]
[]
[]
[]
[]
[null,null,"Agradecimientos: \nEUPHOROS, \"Efficient use of inputs in protected horticulture\", EU-FP7-KBBE-2007-1 (contrato n° 211457)\n"]

{"sheet":"Parametri","index":2,"n_rows":55,"n_cols":50,"rows_kept":55,"cut":false,"hidden":false,"merged":[[4,9,4,12],[4,14,4,17],[6,9,6,12],[6,14,6,17],[16,2,16,11],[13,1,13,14],[8,14,8,17],[8,9,8,12],[16,12,16,17],[54,3,54,4],[48,2,48,10],[41,9,41,16],[48,11,48,16],[31,1,31,5],[34,2,34,11],[34,12,34,16],[51,1,51,8],[51,10,51,16],[53,3,53,4]]}
[null," "]
[null,null,"Entrada"]
[]
[]
[null,null,null,null,null,null,null,null,null,"Guía rápida de inicio",null,null,null,null,"Conversor de unidades (ppm>mM)"]
[]
[null,null,null,null,null,null,null,null,null,"Soluciones nutritivas",null,null,null,null,"Fertilizantes y ácidos"]
[]
[null,null,null,null,null,null,null,null,null,"Informe",null,null,null,null,"Cálculo"]
[]
[]
[]
[]
[null,"1) Introducir composición iónica del agua de riego (en mM para macros y en µM para micros)"]
[null,"?"]
[null,"CE (dS/m)","HCO3-","N-NO3","N-NH4","P-PO4","K","Ca","Mg","Na","S-SO4","Cl","Fe","B","Cu","Zn","Mn","Mo",null,null,null,null,null,null,null,null,null,null,null,null,null,null,null,"Somma cationi acqua irrigua"]
[null,null,"millimoles/L",null,null,null,null,null,null,null,null,null,"micromoles/L",null,null,null,null,null,null,null,null,null,null,null,null,null,null,null,null,null,null,null,null,{"$f":"E18+G18+H18*2+I18*2+J18","v":9.1300000000000008},{"$f":"AH17-AH21","v":4.0000000000000924E-2}]
[null,{"$f":"IF(SUM(E18,G18,H18,I18)>0,(E18+G18+H18*2+I18*2+J18)*0.095+0.19,0)","v":1.05735},{"$f":"'[1]mezcla aguas'!C8","v":2.25},{"$f":"'[1]mezcla aguas'!D8","v":0.66},{"$f":"'[1]mezcla aguas'!E8","v":0},{"$f":"'[1]mezcla aguas'!F8","v":0.01},{"$f":"'[1]mezcla aguas'!G8","v":0.08},{"$f":"'[1]mezcla aguas'!H8","v":2.4},{"$f":"'[1]mezcla aguas'!I8","v":1.89},{"$f":"'[1]mezcla aguas'!J8","v":0.47},{"$f":"'[1]mezcla aguas'!K8","v":1.59},{"$f":"'[1]mezcla aguas'!L8","v":2.99},{"$f":"'[1]mezcla aguas'!M8","v":3.6},{"$f":"'[1]mezcla aguas'!N8","v":20.399999999999999},{"$f":"'[1]mezcla aguas'!O8","v":0},{"$f":"'[1]mezcla aguas'!P8","v":0},{"$f":"'[1]mezcla aguas'!Q8","v":1.6},{"$f":"'[1]mezcla aguas'!R8","v":0},null,null,null,null,null,null,null,null,null,null,null,null,null,null,null,"Somma anioni acqua irrigua"]
[]
[null,"Prueba de ajuste de equilibrio iónico",null,null,null,"?"]
[null,{"$f":"IF(AI17>1,\"[Cationes] > [Aniones]\",IF(AI17<-1,\"[Aniones] > [Cationes]\",\"OK\"))","v":"OK"},null,null,null,null,null,null,null,null,null,null,null,null,null,null,null,null,null,null,null,null,null,null,null,null,null,null,null,null,null,null,null,{"$f":"C18+D18+F18+K18*2+L18","v":9.09}]
[]
[null,"Evaluación de la calidad del agua.",null,null,null,"?"]
[null,{"$f":"IF(B18<1.001,\"OK\",\"HIGH\")","v":"HIGH"},{"$f":"IF(C18<5.01,\"OK\",\"ALTO\")","v":"OK"},{"$f":"IF(D18<3.571,\"OK\",\"ALTO\")","v":"OK"},{"$f":"IF(E18<1.001,\"OK\",\"ALTO\")","v":"OK"},{"$f":"IF(F18<1.001,\"OK\",\"ALTO\")","v":"OK"},{"$f":"IF(G18<2.501,\"OK\",\"ALTO\")","v":"OK"},{"$f":"IF(H18<4.001,\"OK\",\"ALTO\")","v":"OK"},{"$f":"IF(I18<1.001,\"OK\",\"ALTO\")","v":"ALTO"},{"$f":"IF(J18<3.001,\"OK\",\"ALTO\")","v":"OK"},{"$f":"IF(K18<2.801,\"OK\",\"ALTO\")","v":"OK"},{"$f":"IF(L18<3.001,\"OK\",\"ALTO\")","v":"OK"},{"$f":"IF(M18>53.71,\"ALTO\",\"OK\")","v":"OK"},{"$f":"IF(N18<69.401,\"OK\",\"ALTO\")","v":"OK"},{"$f":"IF(O18>15.731,\"ALTO\",\"OK\")","v":"OK"},{"$f":"IF(P18>30.591,\"ALTO\",\"OK\")","v":"OK"},{"$f":"IF(Q18>9.101,\"ALTO\",\"OK\")","v":"OK"},{"$f":"IF(R18>2.081,\"ALTO\",\"OK\")","v":"OK"}]
[]
[null,"2) Parámetros del equipo de fertirriego",null,null,null,null,"?"]
[null,"Relación de dilución de las soluciones madre",null,null,null,null,null,null,100,"  X",{"$f":"IF(I27>239.9,\"Existe riesgo de precipitación en la solución madre\",\"OK\")","v":"OK"}]
[null,"Volumen de los tanques de solución madre (L)",null,null,null,null,null,null,1500]
[]
[null,"3) Seleccionar la solución nutritiva",null,null,null,"?",null,null,null,null,null,null,null,null,null,null,null,null,null,null,null,null,null,null,null,null,2,null,null,null,null,null,null,null,"Coltura: ",null,"Stadio fenologico:"]
[null,null,null,null,null,null,null,null,null,null,null,null,null,null,null,null,null,null,null,null,null,null,null,null,null,null,8,null,null,null,null,null,null,null,{"$f":"B32","v":"FVH: Fase: 4 sem"}]
[null,"FVH: Fase: 4 sem"]
[]
[null,"CE (dS/m)","N-NO3","N-NH4","P-PO4","K","Ca","Mg","Na","S-SO4","Cl","Fe","B","Cu","Zn","Mn","Mo",null,null,null,null,null,null,null,null,null,null,null,null,null,null,null,null,"EC (mS/cm)","HCO3-","N-NO3","N-NH4","P-PO4","K","Ca","Mg","Na","S-SO4","Cl","Fe","B","Cu","Zn","Mn","Mo"]
[null,null,"millimoles/L",null,null,null,null,null,null,null,null,null,"micromoles/L"]
[null,{"$f":"IF(SUM(D36,G36,H36,I36)>0,(D36+F36+G36*2+H36*2+I36)*0.095+0.19,0)","v":1.4535},{"$f":"VLOOKUP($B$32,'Formule nutritive'!BA9:BQ58,3,FALSE)","v":8},{"$f":"VLOOKUP($B$32,'Formule nutritive'!BA9:BQ58,4,FALSE)","v":1.5},{"$f":"VLOOKUP($B$32,'Formule nutritive'!BA9:BQ58,5,FALSE)","v":1},{"$f":"VLOOKUP(B32,'Formule nutritive'!BA9:BQ58,6,FALSE)","v":3},{"$f":"VLOOKUP($B$32,'Formule nutritive'!BA9:BQ58,7,FALSE)","v":2.5},{"$f":"VLOOKUP($B$32,'Formule nutritive'!BA9:BQ58,8,FALSE)","v":1.9},{"$f":"VLOOKUP($B$32,'Formule nutritive'!BA9:BQ58,9,FALSE)","v":0},{"$f":"VLOOKUP($B$32,'Formule nutritive'!BA9:BQ58,10,FALSE)","v":2},{"$f":"VLOOKUP($B$32,'Formule nutritive'!BA9:BQ58,11,FALSE)","v":0},{"$f":"VLOOKUP($B$32,'Formule nutritive'!BA9:BQ58,12,FALSE)","v":10},{"$f":"VLOOKUP($B$32,'Formule nutritive'!BA9:BQ58,13,FALSE)","v":0.8},{"$f":"VLOOKUP($B$32,'Formule nutritive'!BA9:BQ58,14,FALSE)","v":0.05},{"$f":"VLOOKUP($B$32,'Formule nutritive'!BA9:BQ58,15,FALSE)","v":0.05},{"$f":"VLOOKUP($B$32,'Formule nutritive'!BA9:BQ58,16,FALSE)","v":4.5999999999999996},{"$f":"VLOOKUP($B$32,'Formule nutritive'!BA9:BQ58,17,FALSE)","v":0.4},{"$f":"INDEX('Formule nutritive'!S9:S58,Parametri!$AK$32)","v":""},null,null,null,null,null,null,null,null,null,null,null,null,null,null,null,{"$f":"IF((AK36+AM36+AN36*2+AO36*2+AP36)>0,((AK36+AM36+AN36*2+AO36*2+AP36)*0.095+0.19),0)","v":1.4981500000000001},{"$f":"C18","v":2.25},{"$f":"IF(D18>C36,D18,C36)","v":8},1.5,1,3,2.5,1.9,0.47,2,2.99,10,20.399999999999999,0.05,0.05,4.5999999999999996,0.4]
[null,"ppm",{"$f":"C36*14.007","v":112.056},{"$f":"D36*14.007","v":21.0105},{"$f":"E36*30.97","v":30.97},{"$f":"F36*39.1","v":117.30000000000001},{"$f":"G36*40.08","v":100.19999999999999},{"$f":"H36*24.31","v":46.188999999999993},{"$f":"I36*22.9898","v":0},{"$f":"J36*32","v":64},{"$f":"K36*35.47","v":0},{"$f":"L36*55.85/1000","v":0.5585},{"$f":"M36*10.8/1000","v":8.6400000000000001E-3},{"$f":"N36*63.55/1000","v":3.1775000000000002E-3},{"$f":"O36*65.38/1000","v":3.2690000000000002E-3},{"$f":"P36*54.94/1000","v":0.25272399999999995},{"$f":"Q36*95.95/1000","v":3.8380000000000004E-2}]
[null,"Test ",{"$f":"IF(C36>18,\"Anom.\",\"\")","v":""},{"$f":"IF(D36>3,\"Anom.\",\"\")","v":""},{"$f":"IF(E36>2,\"Anom.\",\"\")","v":""},{"$f":"IF(F36>10,\"Anom.\",\"\")","v":""},{"$f":"IF(G36>5,\"Anom.\",\"\")","v":""},{"$f":"IF(H36>2,\"Anom.\",\"\")","v":""},{"$f":"IF(I36>6.5,\"Anom.\",\"\")","v":""},{"$f":"IF(J36>6.5,\"Anom.\",\"\")","v":""},{"$f":"IF(K36>4.5,\"Anom.\",\"\")","v":""},{"$f":"IF(L36>69.5,\"Anom.\",\"\")","v":""},{"$f":"IF(M36>70,\"Anom.\",\"\")","v":""},{"$f":"IF(N36>15,\"Anom.\",\"\")","v":""},{"$f":"IF(O36>23.01,\"Anom.\",\"\")","v":""},{"$f":"IF(P36>36,\"Anom.\",\"\")","v":""},{"$f":"IF(Q36>8.01,\"Anom.\",\"\")","v":""},null,null,null,null,null,null,null,null,null,null,null,null,null,null,null,null,null,"EC (mS/cm)","N-NO3","N-NH4","P-PO4","K","Ca","Mg","Na","S-SO4","Cl"]
[null,null,null,null,null,null,null,null,null,null,null,null,null,null,null,null,null,null,null,null,null,null,null,null,null,null,null,null,null,null,null,null,null,{"$f":"IF(AH36>0,(((I42-0.19)/0.095)-((B18-0.19)/0.095))/(((AH36-0.19)/0.095)-((B18-0.19)/0.095)),0)","v":1},{"$f":"IF((AK39+AM39+AN39*2+AO39*2+AP39)>0,((AK39+AM39+AN39*2+AO39*2+AP39)*0.095+ 0.19),0)","v":1.4981500000000001},{"$f":"IF(C36*$AH$39>D18,C36*$AH$39,D18)","v":8},1.5,1,3,2.5,1.9,0.47,2,2.99]
[null,"pH",null,null,"CE (dS/m) ",null,"?",null,"CE (dS/m) consigna",null,null,null,"?",null,null,null,null,null,null,null,null,null,null,null,null,null,null,null,null,null,null,null,null,{"$f":"IF(AI39-I$42>0.1,AH39-0.1,IF(I$42-AI39>0.1,AH39+0.1,AH39))","v":1},{"$f":"IF((AK40+AM40+AN40*2+AO40*2+AP40)>0,((AK40+AM40+AN40*2+AO40*2+AP40)*0.095+ 0.19),0)","v":1.4981500000000001},{"$f":"IF(C36*$AH$40>D18,C36*$AH$40,D18)","v":8},1.5,1,3,2.5,1.9,0.47,2,2.99]
[null,null,null,null,"calculada",null,null,null,null,null,null,null,null,null,null,null,null,null,null,null,null,null,null,null,null,null,null,null,null,null,null,null,null,{"$f":"IF(AI40-I$42>0.1,AH40-0.1,IF(I$42-AI40>0.1,AH40+0.1,AH40))","v":1},1.4981500000000001,{"$f":"IF(C36*$AH$41>D18,C36*$AH$41,D18)","v":8},1.5,1,3,2.5,1.9,0.47,2,2.99]
[null,6.5,null,null,null,{"$f":"AH36","v":1.4981500000000001},null,null,{"$f":"F42","v":1.4981500000000001},{"$f":"IF(I42<B18+0.5,\"¡CE SIMILAR A LA CE DEL AGUA DE RIEGO! \",IF(I42>B18+2.8,\"¡VALOR DE CE ELEVADO!\",\"OK\"))","v":"¡CE SIMILAR A LA CE DEL AGUA DE RIEGO! "},null,null,null,null,null,null,null,null,null,null,null,null,null,null,null,null,null,null,null,null,null,null,null,{"$f":"IF(AI41-I$42>0.1,AH41-0.1,IF(I$42-AI41>0.1,AH41+0.1,AH41))","v":1},1.4981500000000001,{"$f":"IF(C36*$AH$42>D18,C36*$AH$42,D18)","v":8},1.5,1,3,2.5,1.9,0.47,2,2.99]
[null,null,null,null,null,null,null,null,null,null,null,null,null,null,null,null,null,null,null,null,null,null,null,null,null,null,null,null,null,null,null,null,null,{"$f":"IF(AI42-I$42>0.05,AH42-0.05,IF(I$42-AI42>0.05,AH42+0.05,AH42))","v":1},1.4981500000000001,{"$f":"IF(C36*$AH$43>D18,C36*$AH$43,D18)","v":8},1.5,1,3,2.5,1.9,0.47,2,2.99]
[null,null,null,null,null,null,null,null,null,null,null,null,null,null,null,null,null,null,null,null,null,null,null,null,null,null,null,null,null,null,null,null,null,{"$f":"IF(AI43-I$42>0.05,AH43-0.05,IF(I$42-AI43>0.05,AH43+0.05,AH43))","v":1},1.4981500000000001,{"$f":"IF(C36*$AH$44>D18,C36*$AH$44,D18)","v":8},1.5,1,3,2.5,1.9,0.47,2,2.99]
[null,"4) Solución nutritiva real",null,null,null,null,null,null,null,null,null,null,null,null,null,null,null,null,null,null,null,null,null,null,null,null,null,null,null,null,null,null,null,{"$f":"IF(AI44-I$42>0.02,AH44-0.02,IF(I$42-AI44>0.02,AH44+0.02,AH44))","v":1},1.4981500000000001,{"$f":"IF(C36*$AH$45>D18,C36*$AH$45,D18)","v":8},1.5,1,3,2.5,1.9,0.47,2,2.99]
[null,null,null,null,null,null,null,null,null,null,null,null,null,null,null,null,null,null,null,null,null,null,null,null,null,null,null,null,null,null,null,null,null,{"$f":"IF(AI45-I$42>0.01,AH45-0.01,IF(I$42-AI45>0.01,AH45+0.01,AH45))","v":1},1.4981500000000001,{"$f":"IF(C36*$AH$46>D18,C36*$AH$46,D18)","v":8},1.5,1,3,2.5,1.9,0.47,2,2.99]
[null,"CE (dS/m)","N-NO3","N-NH4","P-PO4","K","Ca","Mg","Na","S-SO4","Cl","Fe","B","Cu","Zn","Mn","Mo",null,null,null,null,null,null,null,null,null,null,null,null,null,null,null,null,{"$f":"IF(AI46-I$42>0.01,AH46-0.01,IF(I$42-AI46>0.01,AH46+0.01,AH46))","v":1},1.4981500000000001,{"$f":"IF(C36*$AH$47>D18,C36*$AH$47,D18)","v":8},1.5,1,3,2.5,1.9,0.47,2,2.99]
[null,{"$f":"IF(SUM(D48,G48,H48,I48)>0,(D48+F48+G48*2+H48*2+I48)*0.095+0.19,0)","v":1.4981500000000001},{"$f":"AJ48","v":8},{"$f":"AK48","v":1.5},1,3,2.5,1.9,0.47,2,2.99,{"$f":"IF(M18>L36,M18,L36)","v":10},20.399999999999999,0.05,0.05,4.5999999999999996,0.4,null,null,null,null,null,null,null,null,null,null,null,null,null,null,null,null,{"$f":"IF(AI47-I$42>0.01,AH47-0.01,IF(I$42-AI47>0.01,AH47+0.01,AH47))","v":1},1.4981500000000001,{"$f":"IF(C36*$AH$48>D18,C36*$AH$48,D18)","v":8},1.5,1,3,2.5,1.9,0.47,2,2.99]
[null,null,"ppm",null,null,null,null,null,null,null,null,"ppm"]
[null,"?",{"$f":"C48*14.007","v":112.056},{"$f":"D48*14.007","v":21.0105},{"$f":"E48*30.974","v":30.974},{"$f":"F48*39.1","v":117.30000000000001},{"$f":"G48*40.08","v":100.19999999999999},{"$f":"H48*24.312","v":46.192799999999998},{"$f":"I48*22.9898","v":10.805205999999998},{"$f":"J48*32.066","v":64.132000000000005},{"$f":"K48*35.453","v":106.00447000000001},{"$f":"L48*55.85/1000","v":0.5585},{"$f":"M48*10.8/1000","v":0.22031999999999999},{"$f":"N48*63.55/1000","v":3.1775000000000002E-3},{"$f":"O48*65.38/1000","v":3.2690000000000002E-3},{"$f":"P48*54.94/1000","v":0.25272399999999995},{"$f":"Q48*95.95/1000","v":3.8380000000000004E-2}]
[]
[null,"Relación molar de la solución nutritiva",null,null,null,null,null,null,null,null,"Relación K:Ca:Mg (expresados en miliequivalentes)"]
[]
[null,"N:K",null,"N-NH4:N-NO3",null,null,"K:","Ca:","Mg",null,null,null,"K:","Ca:","Mg"]
[null,{"$f":"(C48+D48)/F48","v":3.1666666666666665},null,{"$f":"D48/C48","v":0.1875},null,null,{"$f":"F48/($F$48+$G$48+$H$48)","v":0.40540540540540537},{"$f":"G48/($F$48+$G$48+$H$48)","v":0.33783783783783783},{"$f":"H48/($F$48+$G$48+$H$48)","v":0.25675675675675674},null,null,null,{"$f":"F48/($F$48+$G$48*2+$H$48*2)","v":0.25423728813559321},{"$f":"G48*2/($F$48+$G$48*2+$H$48*2)","v":0.42372881355932202},{"$f":"H48*2/($F$48+$G$48*2+$H$48*2)","v":0.32203389830508472}]

{"sheet":"Acidi & concimi","index":3,"n_rows":55,"n_cols":49,"rows_kept":55,"cut":false,"hidden":false,"merged":[[32,4,32,5],[43,4,43,5],[33,4,33,5],[34,4,34,5],[33,1,33,3],[34,1,34,3],[35,1,35,3],[36,1,36,3],[32,1,32,3],[47,4,47,5],[46,4,46,5],[44,4,44,5],[47,1,47,3],[37,1,37,3],[38,1,38,3],[40,1,40,3],[41,1,41,3],[42,1,42,3],[46,1,46,3],[45,1,45,3],[43,1,43,3],[44,1,44,3],[45,4,45,5],[48,1,48,3],[49,1,49,3],[52,4,52,5],[54,4,54,5],[48,4,48,5],[49,4,49,5],[50,4,50,5],[51,4,51,5],[51,1,51,3],[52,1,52,3],[54,1,54,3],[53,1,53,3],[50,1,50,3],[27,1,27,3],[19,4,19,5],[20,4,20,5],[20,1,20,3],[31,1,31,3],[28,1,28,3],[29,1,29,3],[30,1,30,3],[27,4,27,5],[29,4,29,5],[30,4,30,5],[21,4,21,5],[23,4,23,5],[24,4,24,5],[25,4,25,5],[26,1,26,3],[11,1,11,2],[12,1,12,2],[24,1,24,3],[25,1,25,3],[15,1,15,3],[14,1,14,3],[16,1,16,3],[17,1,17,3],[18,1,18,3],[19,1,19,3],[21,1,21,3],[22,1,22,3],[23,1,23,3],[9,1,9,2],[10,1,10,2],[1,8,1,11],[1,13,1,16],[3,8,3,11],[5,8,5,11],[3,13,3,16],[5,13,5,16]]}
[null,null,"Fertilizantes y ácidos"]
[null,null,null,null,null,null,null,null,"Guía rápida de inicio",null,null,null,null,"Conversor de unidades (ppm>mM)"]
[]
[null,"?",null,null,null,null,null,null,"Soluciones nutritivas",null,null,null,null,"Cálculo"]
[]
[null,null,null,null,null,null,null,null,"Informe",null,null,null,null,"Entrada",null,null,null,null,null,null,null,null,null,null,null,null,null,null,null,null,null,null,null,null,"Tabella dei coefficienti moltiplicatori relativi ai contenuti dei vari elementi nei concimi e acidi"]
[null,"Ácidos para neutralización de carbonatos",null,null,null,null,null,null,null,null,null,null,null,null,null,null,null,null,null,null,null,null,null,null,null,null,null,null,null,null,null,null,null,"Acidi per la neutralizzazione"]
[null,null,null,"% p/p","Fórmula química",null,"Densidad","Euro/L","%N-NO3","%N-NH4","% P2O5","% K2O","% CaO","% MgO"," % Na","% SO3","% Cl"," % Fe","% B","% Cu","% Zn","% Mn","% Mo",null,null,null,null,null,null,null,null,null,null,null,"N-NO3","N-NH4","P","K","Ca","Mg","Na","S-SO4","Cl","Fe","B","Cu","Zn","Mn","Mo"]
[null,null,null,null,null,null,"(Kg/L)"]
[null,"Ácido nítrico",null,65,"HNO3",null,1.39,0.72299999999999998,{"$f":"$D10*14.007/63","v":14.451666666666666},null,null,null,null,null,null,null,null,null,null,null,null,null,null,null,null,null,null,null,null,null,null,null,null,{"$f":"B10","v":"Ácido nítrico"},{"$f":"I10/14.007/100","v":1.0317460317460315E-2}]
[null,"Ácido fosfórico",null,85,"H3PO4",null,1.6890000000000001,1.431,null,null,{"$f":"($D11*30.974/97.998)*2.291","v":61.549438662013507},null,null,null,null,null,null,null,null,null,null,null,null,null,null,null,null,null,null,null,null,null,null,{"$f":"B11","v":"Ácido fosfórico"},null,null,{"$f":"K11*0.4364/30.974/100","v":8.6718457519541214E-3}]
[null,"Ácido sulfúrico",null,96,"H2SO4",null,1.84,0.47499999999999998,null,null,null,null,null,null,null,{"$f":"($D12*32.064/98.08)*2.497","v":78.365880587275697},null,null,null,null,null,null,null,null,null,null,null,null,null,null,null,null,null,{"$f":"B12","v":"Ácido sulfúrico"},null,null,null,null,null,null,null,{"$f":"D12/98.08/100","v":9.7879282218597055E-3}]
[null,"Ácido clorhídrico",null,36.5,"HCl",null,1.1859999999999999,0.5,null,null,null,null,null,null,null,null,{"$f":"$D13*35.453/36.461","v":35.490921806862133},null,null,null,null,null,null,null,null,null,null,null,null,null,null,null,null,{"$f":"B13","v":"Ácido clorhídrico"},null,null,null,null,null,null,null,null,{"$f":"Q13/45.453/100","v":7.8082682786311417E-3}]
[]
[null,"Fertilizantes pre-mezclados",null,null,"?",null,null,"Euro/Kg","%N-NO3","%N-NH4","% P2O5","% K2O","% CaO","% MgO"," % Na","% SO3","% Cl"," % Fe","% B","% Cu","% Zn","% Mn","% Mo",null,null,null,null,null,null,null,null,null,null,"Idrosolubili complessi","N-NO3","N-NH4","P","K","Ca","Mg","Na","S-SO4","Cl","Fe","B","Cu","Zn","Mn","Mo"]
[null,"Fertilizante soluble 1",null,null,null,null,null,null,null,null,null,null,null,null,null,null,null,null,null,null,null,null,null,null,null,null,null,null,null,null,null,null,null,{"$f":"B16","v":"Fertilizante soluble 1"},{"$f":"I16/14.007/100","v":0},0,{"$f":"K16*0.4364/30.974/100","v":0},{"$f":"L16*0.83/39.1/100","v":0},{"$f":"M16*0.715/40.08/100","v":0},{"$f":"N16*0.603/24.312/100","v":0},{"$f":"O16/22.9898/100","v":0},{"$f":"P16*0.4/32.064/100","v":0},{"$f":"Q16/35.453/100","v":0},{"$f":"R16/55.85/100","v":0},{"$f":"S16/10.8/100","v":0},{"$f":"T16/63.55/100","v":0},{"$f":"U16/65.38/100","v":0},{"$f":"V16/54.94/100","v":0},{"$f":"W16/95.95/100","v":0}]
[null,"Fertilizante soluble 2",null,null,null,null,null,null,null,null,null,null,null,null,null,null,null,null,null,null,null,null,null,null,null,null,null,null,null,null,null,null,null,{"$f":"B17","v":"Fertilizante soluble 2"},0,0,{"$f":"K17*0.4364/30.974/100","v":0},{"$f":"L17*0.83/39.1/100","v":0},{"$f":"M17*0.715/40.08/100","v":0},{"$f":"N17*0.603/24.312/100","v":0},{"$f":"O17/22.9898/100","v":0},{"$f":"P17*0.4/32/100","v":0},{"$f":"Q17/35.453/100","v":0},{"$f":"R17/55.85/100","v":0},{"$f":"S17/10.8/100","v":0},{"$f":"T17/63.55/100","v":0},{"$f":"U17/65.38/100","v":0},{"$f":"V17/54.94/100","v":0},{"$f":"W17/95.95/100","v":0}]
[null,"Fertilizante soluble 3",null,null,null,null,null,null,null,null,null,null,null,null,null,null,null,null,null,null,null,null,null,null,null,null,null,null,null,null,null,null,null,{"$f":"B18","v":"Fertilizante soluble 3"},0,0,{"$f":"K18*0.4364/30.974/100","v":0},{"$f":"L18*0.83/39.1/100","v":0},{"$f":"M18*0.715/40.08/100","v":0},{"$f":"N18*0.603/24.312/100","v":0},{"$f":"O18/22.9898/100","v":0},{"$f":"P18*0.4/32/100","v":0},{"$f":"Q18/35.453/100","v":0},{"$f":"R18/55.85/100","v":0},{"$f":"S18/10.8/100","v":0},{"$f":"T18/63.55/100","v":0},{"$f":"U18/65.38/100","v":0},{"$f":"V18/54.94/100","v":0},{"$f":"W18/95.95/100","v":0}]
[null,"Fertilizantes cálcicos",null,null,null,null,null,null,null,null,null,null,null,null,null,null,null,null,null,null,null,null,null,null,null,null,null,null,null,null,null,null,null,"Sali contenenti calcio"]
[null,"Nitrato cálcico",null,null,"5[Ca(NO3)2*2H2O]NH4NO3",null,null,0.3,14.3,1.3,null,null,26,null,null,null,null,null,null,null,null,null,null,null,null,null,null,null,null,null,null,null,null,{"$f":"B20","v":"Nitrato cálcico"},{"$f":"I20/14.007/100","v":1.0209181123723854E-2},9.2810737488398655E-4,{"$f":"K20*0.4364/30.974/100","v":0},{"$f":"L20*0.83/39.1/100","v":0},{"$f":"M20*0.715/40.08/100","v":4.6382235528942117E-3},{"$f":"N20*0.603/24.312/100","v":0},{"$f":"O20/22.9898/100","v":0},{"$f":"P20*0.4/32/100","v":0},{"$f":"Q20/35.453/100","v":0},{"$f":"R20/55.85/100","v":0},{"$f":"S20/10.8/100","v":0},{"$f":"T20/63.55/100","v":0},{"$f":"U20/65.38/100","v":0},{"$f":"V20/54.94/100","v":0},{"$f":"W20/95.95/100","v":0}]
[null,"Nitrato cálcico puro",null,null,"Ca(NO3)2*4H2O",null,null,0.29799999999999999,11.9,null,null,null,23.8,null,null,null,null,null,null,null,null,null,null,null,null,null,null,null,null,null,null,null,null,{"$f":"B21","v":"Nitrato cálcico puro"},8.4957521239380322E-3,0,{"$f":"K21*0.4364/30.974/100","v":0},{"$f":"L21*0.83/39.1/100","v":0},{"$f":"M21*0.715/40.08/100","v":4.2457584830339319E-3},{"$f":"N21*0.603/24.312/100","v":0},{"$f":"O21/22.9898/100","v":0},{"$f":"P21*0.4/32/100","v":0},{"$f":"Q21/35.453/100","v":0},{"$f":"R21/55.85/100","v":0},{"$f":"S21/10.8/100","v":0},{"$f":"T21/63.55/100","v":0},{"$f":"U21/65.38/100","v":0},{"$f":"V21/54.94/100","v":0},{"$f":"W21/95.95/100","v":0}]
[null,"Cloruro cálcico",null,null,"CaCl2",null,null,null,null,null,null,null,50.5,null,null,null,63.8,null,null,null,null,null,null,null,null,null,null,null,null,null,null,null,null,{"$f":"B22","v":"Cloruro cálcico"},0,0,{"$f":"K22*0.4364/30.974/100","v":0},{"$f":"L22*0.83/39.1/100","v":0},{"$f":"M22*0.715/40.08/100","v":9.0088572854291425E-3},{"$f":"N22*0.603/24.312/100","v":0},{"$f":"O22/22.9898/100","v":0},{"$f":"P22*0.4/32/100","v":0},{"$f":"Q22/35.453/100","v":1.799565622091219E-2},{"$f":"R22/55.85/100","v":0},{"$f":"S22/10.8/100","v":0},{"$f":"T22/63.55/100","v":0},{"$f":"U22/65.38/100","v":0},{"$f":"V22/54.94/100","v":0},{"$f":"W22/95.95/100","v":0}]
[null,"Fertilizantes amónicos",null,null,null,null,null,null,null,null,null,null,null,null,null,null,null,null,null,null,null,null,null,null,null,null,null,null,null,null,null,null,null,"Sali contenenti Ammonio"]
[null,"Nitrato amónico",null,null,"NH4NO3",null,null,0.29799999999999999,17.2,17.2,null,null,null,null,null,null,null,null,null,null,null,null,null,null,null,null,null,null,null,null,null,null,null,{"$f":"B24","v":"Nitrato amónico"},{"$f":"I24/14.007/100","v":1.2279574498465054E-2},1.2279574498465054E-2,{"$f":"K24*0.4364/30.974/100","v":0},{"$f":"L24*0.83/39.1/100","v":0},{"$f":"M24*0.715/40.08/100","v":0},{"$f":"N24*0.603/24.312/100","v":0},{"$f":"O24/22.9898/100","v":0},{"$f":"P24*0.4/32/100","v":0},{"$f":"Q24/35.453/100","v":0},{"$f":"R24/55.85/100","v":0},{"$f":"S24/10.8/100","v":0},{"$f":"T24/63.55/100","v":0},{"$f":"U24/65.38/100","v":0},{"$f":"V24/54.94/100","v":0},{"$f":"W24/95.95/100","v":0}]
[null,"Sulfato amónico",null,null,"(NH4)2SO4",null,null,0.16300000000000001,null,21.2,null,null,null,null,null,60.6,null,null,null,null,null,null,null,null,null,null,null,null,null,null,null,null,null,{"$f":"B25","v":"Sulfato amónico"},0,1.5135289498108089E-2,{"$f":"K25*0.4364/30.974/100","v":0},{"$f":"L25*0.83/39.1/100","v":0},{"$f":"M25*0.715/40.08/100","v":0},{"$f":"N25*0.603/24.312/100","v":0},{"$f":"O25/22.9898/100","v":0},{"$f":"P25*0.4/32/100","v":7.575000000000001E-3},{"$f":"Q25/35.453/100","v":0},{"$f":"R25/55.85/100","v":0},{"$f":"S25/10.8/100","v":0},{"$f":"T25/63.55/100","v":0},{"$f":"U25/65.38/100","v":0},{"$f":"V25/54.94/100","v":0},{"$f":"W25/95.95/100","v":0}]
[null,"Fosfato monoamónico",null,null,"NH4H2PO4",null,null,0.79800000000000004,null,12.2,61.6,null,null,null,null,null,null,null,null,null,null,null,null,null,null,null,null,null,null,null,null,null,null,{"$f":"B26","v":"Fosfato monoamónico"},0,8.7099307489112588E-3,{"$f":"K26*0.4364/30.974/100","v":8.6789694582553104E-3},{"$f":"L26*0.83/39.1/100","v":0},{"$f":"M26*0.715/40.08/100","v":0},{"$f":"N26*0.603/24.312/100","v":0},{"$f":"O26/22.9898/100","v":0},{"$f":"P26*0.4/32/100","v":0},{"$f":"Q26/35.453/100","v":0},{"$f":"R26/55.85/100","v":0},{"$f":"S26/10.8/100","v":0},{"$f":"T26/63.55/100","v":0},{"$f":"U26/65.38/100","v":0},{"$f":"V26/54.94/100","v":0},{"$f":"W26/95.95/100","v":0}]
[null,"Fertilizantes  fosfóricos ",null,null,null,null,null,null,null,null,null,null,null,null,null,null,null,null,null,null,null,null,null,null,null,null,null,null,null,null,null,null,null,"Sali contenenti Fosforo"]
[null,"Fosfato monopotásico",null,null,"KH2PO4",null,null,0.96099999999999997,null,null,52.2,34.6,null,null,null,null,null,null,null,null,null,null,null,null,null,null,null,null,null,null,null,null,null,{"$f":"B28","v":"Fosfato monopotásico"},{"$f":"I28/14.007/100","v":0},{"$f":"J28/14.007/100","v":0},{"$f":"K28*0.4364/30.974/100","v":7.3545812617033645E-3},{"$f":"L28*0.83/39.1/100","v":7.3447570332480817E-3},{"$f":"M28*0.715/40.08/100","v":0},{"$f":"N28*0.603/24.312/100","v":0},{"$f":"O28/22.9898/100","v":0},{"$f":"P28*0.4/32/100","v":0},{"$f":"Q28/35.453/100","v":0},{"$f":"R28/55.85/100","v":0},{"$f":"S28/10.8/100","v":0},{"$f":"T28/63.55/100","v":0},{"$f":"U28/65.38/100","v":0},{"$f":"V28/54.94/100","v":0},{"$f":"W28/95.95/100","v":0}]
[null,"Fertilizantes magnésicos",null,null,null,null,null,null,null,null,null,null,null,null,null,null,null,null,null,null,null,null,null,null,null,null,null,null,null,null,null,null,null,"Sali contenenti Magnesio"]
[null,"Sulfato de magnesio",null,null,"MgSO4*7H2O",null,null,0.3,null,null,null,null,null,15.9,null,31.75,null,null,null,null,null,null,null,null,null,null,null,null,null,null,null,null,null,{"$f":"B30","v":"Sulfato de magnesio"},{"$f":"I30/14.007/100","v":0},{"$f":"J30/14.007/100","v":0},{"$f":"K30*0.4364/30.974/100","v":0},{"$f":"L30*0.83/39.1/100","v":0},{"$f":"M30*0.715/40.08/100","v":0},{"$f":"N30*0.603/24.312/100","v":3.9436080947680158E-3},{"$f":"O30/22.9898/100","v":0},{"$f":"P30*0.4/32/100","v":3.9687500000000001E-3},{"$f":"Q30/35.453/100","v":0},{"$f":"R30/55.85/100","v":0},{"$f":"S30/10.8/100","v":0},{"$f":"T30/63.55/100","v":0},{"$f":"U30/65.38/100","v":0},{"$f":"V30/54.94/100","v":0},{"$f":"W30/95.95/100","v":0}]
[null,"Nitrato de magnesio",null,null,"Mg(NO3)2*6H2O",null,null,0.91300000000000003,10.95,null,null,null,null,15.7,null,null,null,null,null,null,null,null,null,null,null,null,null,null,null,null,null,null,null,{"$f":"B31","v":"Nitrato de magnesio"},{"$f":"I31/14.007/100","v":7.8175198115228092E-3},{"$f":"J31/14.007/100","v":0},{"$f":"K31*0.4364/30.974/100","v":0},{"$f":"L31*0.83/39.1/100","v":0},{"$f":"M31*0.715/40.08/100","v":0},{"$f":"N31*0.603/24.312/100","v":3.8940029615004926E-3},{"$f":"O31/22.9898/100","v":0},{"$f":"P31*0.4/32/100","v":0},{"$f":"Q31/35.453/100","v":0},{"$f":"R31/55.85/100","v":0},{"$f":"S31/10.8/100","v":0},{"$f":"T31/63.55/100","v":0},{"$f":"U31/65.38/100","v":0},{"$f":"V31/54.94/100","v":0},{"$f":"W31/95.95/100","v":0}]
[null,"Fertilizantes potásicos",null,null,null,null,null,null,null,null,null,null,null,null,null,null,null,null,null,null,null,null,null,null,null,null,null,null,null,null,null,null,null,"Sali contenenti Potassio"]
[null,"Nitrato potásico",null,null,"KNO3",null,null,0.5,13.8,null,null,46.5,null,null,null,null,null,null,null,null,null,null,null,null,null,null,null,null,null,null,null,null,null,{"$f":"B33","v":"Nitrato potásico"},{"$f":"I33/14.007/100","v":9.8522167487684748E-3},0,{"$f":"K33*0.4364/30.974/100","v":0},{"$f":"L33*0.83/39.1/100","v":9.8708439897698206E-3},{"$f":"M33*0.715/40.08/100","v":0},{"$f":"N33*0.603/24.312/100","v":0},{"$f":"O33/22.9898/100","v":0},{"$f":"P33*0.4/32/100","v":0},{"$f":"Q33/35.453/100","v":0},{"$f":"R33/55.85/100","v":0},{"$f":"S33/10.8/100","v":0},{"$f":"T33/63.55/100","v":0},{"$f":"U33/65.38/100","v":0},{"$f":"V33/54.94/100","v":0},{"$f":"W33/95.95/100","v":0}]
[null,"Sulfato potásico",null,null,"K2SO4",null,null,0.42299999999999999,null,null,null,52.05,null,null,null,44.1,null,null,null,null,null,null,null,null,null,null,null,null,null,null,null,null,null,{"$f":"B34","v":"Sulfato potásico"},0,0,{"$f":"K34*0.4364/30.974/100","v":0},{"$f":"L34*0.83/39.1/100","v":1.1048976982097185E-2},{"$f":"M34*0.715/40.08/100","v":0},{"$f":"N34*0.603/24.312/100","v":0},{"$f":"O34/22.9898/100","v":0},{"$f":"P34*0.4/32/100","v":5.5125E-3},{"$f":"Q34/35.453/100","v":0},{"$f":"R34/55.85/100","v":0},{"$f":"S34/10.8/100","v":0},{"$f":"T34/63.55/100","v":0},{"$f":"U34/65.38/100","v":0},{"$f":"V34/54.94/100","v":0},{"$f":"W34/95.95/100","v":0}]
[null,"Cloruro potásico",null,null,"KCl",null,null,0.24299999999999999,null,null,null,61,null,null,null,null,45.9,null,null,null,null,null,null,null,null,null,null,null,null,null,null,null,null,{"$f":"B35","v":"Cloruro potásico"},0,0,{"$f":"K35*0.4364/30.974/100","v":0},{"$f":"L35*0.83/39.1/100","v":1.2948849104859333E-2},{"$f":"M35*0.715/40.08/100","v":0},{"$f":"N35*0.603/24.312/100","v":0},{"$f":"O35/22.9898/100","v":0},{"$f":"P35*0.4/32/100","v":0},{"$f":"Q35/35.453/100","v":1.2946718190280088E-2},{"$f":"R35/55.85/100","v":0},{"$f":"S35/10.8/100","v":0},{"$f":"T35/63.55/100","v":0},{"$f":"U35/65.38/100","v":0},{"$f":"V35/54.94/100","v":0},{"$f":"W35/95.95/100","v":0}]
[null,"Hierro quelatado",null,null,null,null,null,null,null,null,null,null,null,null,null,null,null,null,null,null,null,null,null,null,null,null,null,null,null,null,null,null,null,"Sali contenenti Ferro"]
[null,"Mix micro AZ",null,null,null,null,null,null,null,null,null,null,null,null,null,null,null,6.5,0.1,0.02,0.03,3,0.4,null,null,null,null,null,null,null,null,null,null,{"$f":"B37","v":"Mix micro AZ"},{"$f":"I37/14.007/100","v":0},0,{"$f":"K37*0.4364/30.974/100","v":0},{"$f":"L37*0.83/39.1/100","v":0},{"$f":"M37*0.715/40.08/100","v":0},{"$f":"N37*0.603/24.312/100","v":0},{"$f":"O37/22.9898/100","v":0},{"$f":"P37*0.4/32/100","v":0},{"$f":"Q37/35.453/100","v":0},{"$f":"R37/55.85/100","v":1.1638316920322292E-3},{"$f":"S37/10.8/100","v":9.2592592592592588E-5},{"$f":"T37/63.55/100","v":3.1471282454760031E-6},{"$f":"U37/65.38/100","v":4.5885591924135822E-6},{"$f":"V37/54.94/100","v":5.4605023662176923E-4},{"$f":"W37/95.95/100","v":4.1688379364252222E-5}]
[null,"Hierro  DPTA",null,null,null,null,null,7.9809999999999999,null,null,null,null,null,null,null,null,null,6.5,null,null,null,null,null,null,null,null,null,null,null,null,null,null,null,{"$f":"B38","v":"Hierro  DPTA"},0,0,{"$f":"K38*0.4364/30.974/100","v":0},{"$f":"L38*0.83/39.1/100","v":0},{"$f":"M38*0.715/40.08/100","v":0},{"$f":"N38*0.603/24.312/100","v":0},{"$f":"O38/22.9898/100","v":0},{"$f":"P38*0.4/32/100","v":0},{"$f":"Q38/35.453/100","v":0},{"$f":"R38/55.85/100","v":1.1638316920322292E-3},{"$f":"S38/10.8/100","v":0},{"$f":"T38/63.55/100","v":0},{"$f":"U38/65.38/100","v":0},{"$f":"V38/54.94/100","v":0},{"$f":"W38/95.95/100","v":0}]
[null,"Hierro EDDHA",null,null,null,null,null,10.961,null,null,null,null,null,null,null,null,null,6,null,null,null,null,null,null,null,null,null,null,null,null,null,null,null,{"$f":"B39","v":"Hierro EDDHA"},0,0,{"$f":"K39*0.4364/30.974/100","v":0},{"$f":"L39*0.83/39.1/100","v":0},{"$f":"M39*0.715/40.08/100","v":0},{"$f":"N39*0.603/24.312/100","v":0},{"$f":"O39/22.9898/100","v":0},{"$f":"P39*0.4/32/100","v":0},{"$f":"Q39/35.453/100","v":0},{"$f":"R39/55.85/100","v":1.0743061772605191E-3},{"$f":"S39/10.8/100","v":0},{"$f":"T39/63.55/100","v":0},{"$f":"U39/65.38/100","v":0},{"$f":"V39/54.94/100","v":0},{"$f":"W39/95.95/100","v":0}]
[]
[null,"Microelementos",null,null,null,null,null,"Euro/Kg","%N-NO3","%N-NH4","% P2O5","% K2O","% CaO","% MgO"," % Na","% SO3","% Cl"," % Fe","% B","% Cu","% Zn","% Mn","% Mo",null,null,null,null,null,null,null,null,null,null,"Sali contenenti microelementi"]
[null,"Microelementos MIX 1",null,null,null,null,null,null,null,null,null,null,null,null,null,null,null,4,1,1,1,1,1,null,null,null,null,null,null,null,null,null,null,{"$f":"B42","v":"Microelementos MIX 1"},{"$f":"I42/14.007/100","v":0},{"$f":"J42/14.007/100","v":0},{"$f":"K42*0.4364/30.974/100","v":0},{"$f":"L42*0.83/39.1/100","v":0},{"$f":"M42*0.715/40.08/100","v":0},{"$f":"N42*0.603/24.312/100","v":0},{"$f":"O42/22.9898/100","v":0},{"$f":"P42*0.4/32/100","v":0},{"$f":"Q42/35.453/100","v":0},{"$f":"R42/55.85/100","v":7.1620411817367941E-4},{"$f":"S42/10.8/100","v":9.2592592592592585E-4},{"$f":"T42/63.55/100","v":1.5735641227380016E-4},{"$f":"U42/65.38/100","v":1.5295197308045274E-4},{"$f":"V42/54.94/100","v":1.8201674554058973E-4},{"$f":"W42/95.95/100","v":1.0422094841063054E-4}]
[null,"Microelementos MIX 2",null,null,null,null,null,null,null,null,null,null,null,null,null,null,null,null,null,null,null,null,null,null,null,null,null,null,null,null,null,null,null,"Microelementos MIX 2",0,0,0,0,0,0,0,{"$f":"P43*0.4/32/100","v":0},0,0,0,0,0,0,0]
[null,"Borax",null,null,"Na2B4O7*10H2O",null,null,10.225,null,null,null,null,null,null,12.1,null,null,null,11.3,null,null,null,null,null,null,null,null,null,null,null,null,null,null,"Borax",0,0,0,0,0,0,5.2632036816327244E-3,0,0,0,1.0462962962962962E-2,0,0,0,0]
[null,"Ácido bórico",null,null,"H3BO3",null,null,19.625,null,null,null,null,null,null,null,null,null,null,17.5,null,null,null,null,null,null,null,null,null,null,null,null,null,null,"Ácido bórico",0,0,0,0,0,0,0,0,0,0,1.6203703703703703E-2,0,0,0,0]
[null,"Sulfato de cobre",null,null,"CuSO4*5H2O",null,null,14.46,null,null,null,null,null,null,null,32.1,null,null,null,25.5,null,null,null,null,null,null,null,null,null,null,null,null,null,"Sulfato de cobre",0,0,0,0,0,0,0,4.0125000000000004E-3,0,0,0,4.0125885129819044E-3,0,0,0]
[null,"Cobre quelatado (EDTA)",null,null,null,null,null,17.404,null,null,null,null,null,null,null,null,null,null,null,15,null,null,null,null,null,null,null,null,null,null,null,null,null,"Cobre quelatado (EDTA)",0,0,0,0,0,0,0,0,0,0,0,2.3603461841070024E-3,0,0,0]
[null,"Sulfato de zinc",null,null,"ZnSO4*7H2O",null,null,30.78,null,null,null,null,null,null,null,27.8,null,null,null,null,22.7,null,null,null,null,null,null,null,null,null,null,null,null,"Sulfato de zinc",0,0,0,0,0,0,0,3.4750000000000002E-3,0,0,0,0,3.4720097889262775E-3,0,0]
[null,"Zinc quelatado (EDTA)",null,null,null,null,null,14.663,null,null,null,null,null,null,null,null,null,null,null,null,15,null,null,null,null,null,null,null,null,null,null,null,null,"Zinc quelatado (EDTA)",0,0,0,0,0,0,0,0,0,0,0,0,2.2942795962067912E-3,0,0]
[null,"Sulfato de manganeso",null,null,"MnSO4*H2O",null,null,50,null,null,null,null,null,null,null,47.5,null,null,null,null,null,32.5,null,null,null,null,null,null,null,null,null,null,null,"Sulfato de manganeso",0,0,0,0,0,0,0,5.9375000000000001E-3,0,0,0,0,0,5.915544230069166E-3,0]
[null,"Quelato de manganeso",null,null,null,null,null,30,null,null,null,null,null,null,null,null,null,null,null,null,null,15,null,null,null,null,null,null,null,null,null,null,null,"Quelato de manganeso",0,0,0,0,0,0,0,0,0,0,0,0,0,2.7302511831088462E-3,0]
[null,"Heptamolibdato de amonio",null,null,"(NH4)6Mo7O24*4H2O",null,null,37,null,14,null,null,null,null,null,null,null,null,null,null,null,null,54.4,null,null,null,null,null,null,null,null,null,null,"Heptamolibdato de amonio",0,9.9950024987506252E-3,0,0,0,0,0,0,0,0,0,0,0,0,5.6696195935383008E-3]
[null,"Molibdato de sodio",null,null,"Na2MoO4*2H2O",null,null,37.26,null,null,null,null,null,null,19,null,null,null,null,null,null,null,39.700000000000003,null,null,null,null,null,null,null,null,null,null,"Molibdato de sodio",0,0,0,0,0,0,8.2645347066960129E-3,0,0,0,0,0,0,0,4.137571651902032E-3]
[null,"Sales de sódio"]
[null,"Cloruro sódico",null,null,"NaCl",null,null,0.5,null,null,null,null,null,null,39.340000000000003,null,60.66,null,null,null,null,null,null,null,null,null,null,null,null,null,null,null,null,{"$f":"B55","v":"Cloruro sódico"},{"$f":"I55/14.007/100","v":0},{"$f":"J55/14.007/100","v":0},{"$f":"K55*0.4364/30.974/100","v":0},{"$f":"L55*0.83/39.1/100","v":0},{"$f":"M55*0.715/40.08/100","v":0},{"$f":"N55*0.603/24.312/100","v":0},{"$f":"O55/22.9898/100","v":1.7111936597969536E-2},{"$f":"P55*0.4/32/100","v":0},{"$f":"Q55/35.453/100","v":1.7109976588723094E-2},{"$f":"R55/55.85/100","v":0},{"$f":"S55/10.8/100","v":0},{"$f":"T55/63.55/100","v":0},{"$f":"U55/65.38/100","v":0},{"$f":"V55/54.94/100","v":0},{"$f":"W55/95.95/100","v":0}]

{"sheet":"Formule nutritive","index":4,"n_rows":58,"n_cols":69,"rows_kept":58,"cut":false,"hidden":false,"merged":[[7,18,7,20],[5,7,5,10],[1,12,1,16],[3,12,3,16],[5,12,5,16],[1,7,1,10],[3,7,3,10]]}
[null,"Soluciónes nutritivas"]
[null,null,null,null,null,null,null,"Guía rápida de inicio",null,null,null,null,"Conversor de unidades (ppm>mM)"]
[]
[null,null,null,null,null,null,null,"Cálculo",null,null,null,null,"Fertilizantes y ácidos"]
[]
[null,null,null,"?",null,null,null,"Informe",null,null,null,null,"Entrada"]
[]
["Cultivo","Fase","EC (dS/m)","N-NO3","N-NH4","P-PO4","K","Ca","Mg","Na","S-SO4","Cl","Fe","B","Cu","Zn","Mn","Mo","Prueba de equilibrio iónico",null,null,null,null,"C+ - A-",null,null,null,null,null,null,null,null,null,null,null,null,null,null,null,null,null,null,null,null,null,null,null,null,null,null,null,null,"Coltura Stadio: Stadio","EC (mS/cm)","N-NO3","N-NH4","P-PO4","K","Ca","Mg","Na","S-SO4","Cl","Fe","B","Cu","Zn","Mn","Mo"]
["Berenjena","Simple",{"$f":"IF((G9+H9*2+I9*2+E9+J9)>0,(0.095*(G9+H9*2+I9*2+E9+J9)+0.19),0)","v":1.9570000000000001},15,1,1.3,7,3.5,1.8,0,1.5,0,15,30,1,5,10,1,{"$f":"IF(X9>1,\"[Cationes] > [Aniones]\",IF(X9<-1,\"[Aniones] > [Cationes]\",\"\"))","v":""},null,null,null,null,{"$f":"(E9+G9+H9*2+I9*2+J9)-(D9+F9+K9*2+L9)","v":-0.69999999999999929},null,{"$f":"A9&\": fase \"&B9","v":"Berenjena: fase Simple"},1,null,null,null,null,null,null,null,null,null,null,null,null,null,null,null,null,null,null,null,null,null,null,null,null,null,{"$f":"A9&\": Fase: \"&B9","v":"Berenjena: Fase: Simple"},{"$f":"C9","v":1.9570000000000001},{"$f":"D9","v":15},1,1.3,7,3.5,1.8,0,1.5,0,15,30,{"$f":"O9","v":1},{"$f":"P9","v":5},{"$f":"Q9","v":10},{"$f":"R9","v":1}]
["Calabaza","Simple",2.1660000000000004,16,1.3,1.5,7.5,4,2,0,1.8,0,10,50,1,5,10,1,"",null,null,null,null,-0.30000000000000071,null,"Calabaza: fase Simple",2,null,null,null,null,null,null,null,null,null,null,null,null,null,null,null,null,null,null,null,null,null,null,null,null,null,{"$f":"A10&\": Fase: \"&B10","v":"Calabaza: Fase: Simple"},{"$f":"C10","v":2.1660000000000004},{"$f":"D10","v":16},{"$f":"E10","v":1.3},{"$f":"F10","v":1.5},{"$f":"G10","v":7.5},{"$f":"H10","v":4},{"$f":"I10","v":2},{"$f":"J10","v":0},{"$f":"K10","v":1.8},{"$f":"L10","v":0},{"$f":"M10","v":10},{"$f":"N10","v":50},{"$f":"O10","v":1},{"$f":"P10","v":5},{"$f":"Q10","v":10},{"$f":"R10","v":1}]
["Clavel","Simple",1.7479999999999998,13,1,1.3,6,3.5,1.2,0,1.5,0,25,30,1,5,10,1,"",null,null,null,null,-0.90000000000000213,null,"Clavel: fase Simple",3,null,null,null,null,null,null,null,null,null,null,null,null,null,null,null,null,null,null,null,null,null,null,null,null,null,"Clavel: Fase: Simple",1.7479999999999998,13,1,1.3,6,3.5,1.2,0,1.5,0,25,30,1,5,10,1]
["Fresa","Simple",1.7004999999999999,9.9950024987506243,1,1,5.5,3.5,1.2,0,2,0,20,30,1,5,10,1,"",null,null,null,null,0.90499750124937606,null,"Fresa: fase Simple",4,null,null,null,null,null,null,null,null,null,null,null,null,null,null,null,null,null,null,null,null,null,null,null,null,null,"Fresa: Fase: Simple",1.7004999999999999,9.9950024987506243,1,1,5.5,3.5,1.2,0,2,0,20,30,1,5,10,1]
["Gerbera","Simple",1.52,11,1,1.3,5,3,1,0,1.2,0,35,30,1,5,5,1,"",null,null,null,null,-0.70000000000000107,null,"Gerbera: fase Simple",5,null,null,null,null,null,null,null,null,null,null,null,null,null,null,null,null,null,null,null,null,null,null,null,null,null,"Gerbera: Fase: Simple",1.52,11,1,1.3,5,3,1,0,1.2,0,35,30,1,5,5,1]
["Hoagland & Arnon","Universal (1938)",1.9949999999999999,14,1,1,6,4,2,0,2,0,45,45,1,1,10,1,"",null,null,null,null,0,null,"Hoagland & Arnon: fase Universal (1938)",6,null,null,null,null,null,null,null,null,null,null,null,null,null,null,null,null,null,null,null,null,null,null,null,null,null,"Hoagland & Arnon: Fase: Universal (1938)",1.9949999999999999,14,1,1,6,4,2,0,2,0,45,45,1,1,10,1]
["Hortalizas de fruto","Simple",2.0425,15,1,1.3,7.5,4,1.5,0,2,0,15,30,1,5,10,1,"",null,null,null,null,-0.80000000000000071,null,"Hortalizas de fruto: fase Simple",7,null,null,null,null,null,null,null,null,null,null,null,null,null,null,null,null,null,null,null,null,null,null,null,null,null,"Hortalizas de fruto: Fase: Simple",2.0425,15,1,1.3,7.5,4,1.5,0,2,0,15,30,1,5,10,1]
["Hortalizas de hoja","Simple",2.375,16,2,2,10,4.5,1,0,2.5,0,40,30,1,5,5,1,"",null,null,null,null,0,null,"Hortalizas de hoja: fase Simple",8,null,null,null,null,null,null,null,null,null,null,null,null,null,null,null,null,null,null,null,null,null,null,null,null,null,"Hortalizas de hoja: Fase: Simple",2.375,16,2,2,10,4.5,1,0,2.5,0,40,30,1,5,5,1]
["Judía","Simple",1.7004999999999999,12,1,1.2,5.5,3.5,1.2,0,1.2,0,15,50,1,5,10,2,"",null,null,null,null,0.30000000000000071,null,"Judía: fase Simple",9,null,null,null,null,null,null,null,null,null,null,null,null,null,null,null,null,null,null,null,null,null,null,null,null,null,"Judía: Fase: Simple",1.7004999999999999,12,1,1.2,5.5,3.5,1.2,0,1.2,0,15,50,1,5,10,2]
["Melón Galia","Simple",2.0329999999999999,16,1,1.3,7,4,1.7,0,1.5,0,10,20,1,5,10,1,"",null,null,null,null,-0.90000000000000213,null,"Melón Galia: fase Simple",10,null,null,null,null,null,null,null,null,null,null,null,null,null,null,null,null,null,null,null,null,null,null,null,null,null,"Melón Galia: Fase: Simple",2.0329999999999999,16,1,1.3,7,4,1.7,0,1.5,0,10,20,1,5,10,1]
["Pepino","Simple",1.9949999999999999,15,1,1.2,7,4,1.5,0,1.6,0,15,30,1,5,10,1,"",null,null,null,null,-0.39999999999999858,null,"Pepino: fase Simple",11,null,null,null,null,null,null,null,null,null,null,null,null,null,null,null,null,null,null,null,null,null,null,null,null,null,"Pepino: Fase: Simple",1.9949999999999999,15,1,1.2,7,4,1.5,0,1.6,0,15,30,1,5,10,1]
["Pimiento","Simple",1.9949999999999999,15,1,1.3,8,3.5,1.5,0,1.5,0,15,30,1,5,10,1,"",null,null,null,null,-0.30000000000000071,null,"Pimiento: fase Simple",12,null,null,null,null,null,null,null,null,null,null,null,null,null,null,null,null,null,null,null,null,null,null,null,null,null,"Pimiento: Fase: Simple",1.9949999999999999,15,1,1.3,8,3.5,1.5,0,1.5,0,15,30,1,5,10,1]
["Plantas ornamentales de exterior","Simple",1.3680000000000001,8.5,0.5,1,4.5,2.5,1.2,0,1.5,0,20,20,1,5,10,1,"",null,null,null,null,-9.9999999999999645E-2,null,"Plantas ornamentales de exterior: fase Simple",13,null,null,null,null,null,null,null,null,null,null,null,null,null,null,null,null,null,null,null,null,null,null,null,null,null,"Plantas ornamentales de exterior: Fase: Simple",1.3680000000000001,8.5,0.5,1,4.5,2.5,1.2,0,1.5,0,20,20,1,5,10,1]
["Rosas","Simple",1.52,11,1,1.3,5,3,1,0,1.3,0,25,25,1,5,5,1,"",null,null,null,null,-0.90000000000000036,null,"Rosas: fase Simple",14,null,null,null,null,null,null,null,null,null,null,null,null,null,null,null,null,null,null,null,null,null,null,null,null,null,"Rosas: Fase: Simple",1.52,11,1,1.3,5,3,1,0,1.3,0,25,25,1,5,5,1]
["Tomate","Simple",2.09,14,1,1,8,4,1.5,0,2.5,0,15,20,1,5,10,1,"",null,null,null,null,0,null,"Tomate: fase Simple",15,null,null,null,null,null,null,null,null,null,null,null,null,null,null,null,null,null,null,null,null,null,null,null,null,null,"Tomate: Fase: Simple",2.09,14,1,1,8,4,1.5,0,2.5,0,15,20,1,5,10,1]
["FVH","4 sem",1.4535,8,1.5,1,3,2.5,1.9,0,2,0,10,0.8,0.05,0.05,4.5999999999999996,0.4,"",null,null,null,null,0.30000000000000071,null,"FVH: fase 4 sem",16,null,null,null,null,null,null,null,null,null,null,null,null,null,null,null,null,null,null,null,null,null,null,null,null,null,"FVH: Fase: 4 sem",1.4535,8,1.5,1,3,2.5,1.9,0,2,0,10,0.8,0.05,0.05,4.5999999999999996,0.4]
[null,null,0,null,null,null,null,null,null,null,null,null,null,null,null,null,null,null,"",null,null,null,null,0,null,": fase ",17,null,null,null,null,null,null,null,null,null,null,null,null,null,null,null,null,null,null,null,null,null,null,null,null,null,": Fase: ",0,0,0,0,0,0,0,0,0,0,0,0,0,0,0,0]
["zz nueva solución",": introducir valores",0,null,null,null,null,null,null,null,null,null,null,null,null,null,null,null,"",null,null,null,null,0,null,"zz nueva solución: fase : introducir valores",18,null,null,null,null,null,null,null,null,null,null,null,null,null,null,null,null,null,null,null,null,null,null,null,null,null,"zz nueva solución: Fase: : introducir valores",0,0,0,0,0,0,0,0,0,0,0,0,0,0,0,0]
["zz nueva solución",": introducir valores",0,null,null,null,null,null,null,null,null,null,null,null,null,null,null,null,"",null,null,null,null,0,null,"zz nueva solución: fase : introducir valores",19,null,null,null,null,null,null,null,null,null,null,null,null,null,null,null,null,null,null,null,null,null,null,null,null,null,"zz nueva solución: Fase: : introducir valores",0,0,0,0,0,0,0,0,0,0,0,0,0,0,0,0]
["zz nueva solución",": introducir valores",0,null,null,null,null,null,null,null,null,null,null,null,null,null,null,null,"",null,null,null,null,0,null,"zz nueva solución: fase : introducir valores",20,null,null,null,null,null,null,null,null,null,null,null,null,null,null,null,null,null,null,null,null,null,null,null,null,null,"zz nueva solución: Fase: : introducir valores",0,0,0,0,0,0,0,0,0,0,0,0,0,0,0,0]
["zz nueva solución",": introducir valores",0,null,null,null,null,null,null,null,null,null,null,null,null,null,null,null,"",null,null,null,null,0,null,"zz nueva solución: fase : introducir valores",21,null,null,null,null,null,null,null,null,null,null,null,null,null,null,null,null,null,null,null,null,null,null,null,null,null,"zz nueva solución: Fase: : introducir valores",0,0,0,0,0,0,0,0,0,0,0,0,0,0,0,0]
["zz nueva solución",": introducir valores",0,null,null,null,null,null,null,null,null,null,null,null,null,null,null,null,"",null,null,null,null,0,null,"zz nueva solución: fase : introducir valores",22,null,null,null,null,null,null,null,null,null,null,null,null,null,null,null,null,null,null,null,null,null,null,null,null,null,"zz nueva solución: Fase: : introducir valores",0,0,0,0,0,0,0,0,0,0,0,0,0,0,0,0]
["zz nueva solución",": introducir valores",0,null,null,null,null,null,null,null,null,null,null,null,null,null,null,null,"",null,null,null,null,0,null,"zz nueva solución: fase : introducir valores",23,null,null,null,null,null,null,null,null,null,null,null,null,null,null,null,null,null,null,null,null,null,null,null,null,null,"zz nueva solución: Fase: : introducir valores",0,0,0,0,0,0,0,0,0,0,0,0,0,0,0,0]
["zz nueva solución",": introducir valores",0,null,null,null,null,null,null,null,null,null,null,null,null,null,null,null,"",null,null,null,null,0,null,"zz nueva solución: fase : introducir valores",24,null,null,null,null,null,null,null,null,null,null,null,null,null,null,null,null,null,null,null,null,null,null,null,null,null,"zz nueva solución: Fase: : introducir valores",0,0,0,0,0,0,0,0,0,0,0,0,0,0,0,0]
["zz nueva solución",": introducir valores",0,null,null,null,null,null,null,null,null,null,null,null,null,null,null,null,"",null,null,null,null,0,null,"zz nueva solución: fase : introducir valores",25,null,null,null,null,null,null,null,null,null,null,null,null,null,null,null,null,null,null,null,null,null,null,null,null,null,"zz nueva solución: Fase: : introducir valores",0,0,0,0,0,0,0,0,0,0,0,0,0,0,0,0]
["zz nueva solución",": introducir valores",0,null,null,null,null,null,null,null,null,null,null,null,null,null,null,null,"",null,null,null,null,0,null,"zz nueva solución: fase : introducir valores",26,null,null,null,null,null,null,null,null,null,null,null,null,null,null,null,null,null,null,null,null,null,null,null,null,null,"zz nueva solución: Fase: : introducir valores",0,0,0,0,0,0,0,0,0,0,0,0,0,0,0,0]
["zz nueva solución",": introducir valores",0,null,null,null,null,null,null,null,null,null,null,null,null,null,null,null,"",null,null,null,null,0,null,"zz nueva solución: fase : introducir valores",27,null,null,null,null,null,null,null,null,null,null,null,null,null,null,null,null,null,null,null,null,null,null,null,null,null,"zz nueva solución: Fase: : introducir valores",0,0,0,0,0,0,0,0,0,0,0,0,0,0,0,0]
["zz nueva solución",": introducir valores",0,null,null,null,null,null,null,null,null,null,null,null,null,null,null,null,"",null,null,null,null,0,null,"zz nueva solución: fase : introducir valores",28,null,null,null,null,null,null,null,null,null,null,null,null,null,null,null,null,null,null,null,null,null,null,null,null,null,"zz nueva solución: Fase: : introducir valores",0,0,0,0,0,0,0,0,0,0,0,0,0,0,0,0]
["zz nueva solución",": introducir valores",0,null,null,null,null,null,null,null,null,null,null,null,null,null,null,null,"",null,null,null,null,0,null,"zz nueva solución: fase : introducir valores",29,null,null,null,null,null,null,null,null,null,null,null,null,null,null,null,null,null,null,null,null,null,null,null,null,null,"zz nueva solución: Fase: : introducir valores",0,0,0,0,0,0,0,0,0,0,0,0,0,0,0,0]
["zz nueva solución",": introducir valores",0,null,null,null,null,null,null,null,null,null,null,null,null,null,null,null,"",null,null,null,null,0,null,"zz nueva solución: fase : introducir valores",30,null,null,null,null,null,null,null,null,null,null,null,null,null,null,null,null,null,null,null,null,null,null,null,null,null,"zz nueva solución: Fase: : introducir valores",0,0,0,0,0,0,0,0,0,0,0,0,0,0,0,0]
["zz nueva solución",": introducir valores",0,null,null,null,null,null,null,null,null,null,null,null,null,null,null,null,"",null,null,null,null,0,null,"zz nueva solución: fase : introducir valores",31,null,null,null,null,null,null,null,null,null,null,null,null,null,null,null,null,null,null,null,null,null,null,null,null,null,"zz nueva solución: Fase: : introducir valores",0,0,0,0,0,0,0,0,0,0,0,0,0,0,0,0]
["zz nueva solución",": introducir valores",0,null,null,null,null,null,null,null,null,null,null,null,null,null,null,null,"",null,null,null,null,0,null,"zz nueva solución: fase : introducir valores",32,null,null,null,null,null,null,null,null,null,null,null,null,null,null,null,null,null,null,null,null,null,null,null,null,null,"zz nueva solución: Fase: : introducir valores",0,0,0,0,0,0,0,0,0,0,0,0,0,0,0,0]
["zz nueva solución",": introducir valores",{"$f":"IF((G41+H41*2+I41*2+E41+J41)>0,(0.095*(G41+H41*2+I41*2+E41+J41)+0.19),0)","v":0},null,null,null,null,null,null,null,null,null,null,null,null,null,null,null,{"$f":"IF(X41>1,\"[Cationes] > [Aniones]\",IF(X41<-1,\"[Aniones] > [Cationes]\",\"\"))","v":""},null,null,null,null,{"$f":"(E41+G41+H41*2+I41*2+J41)-(D41+F41+K41*2+L41)","v":0},null,{"$f":"A41&\": fase \"&B41","v":"zz nueva solución: fase : introducir valores"},33,null,null,null,null,null,null,null,null,null,null,null,null,null,null,null,null,null,null,null,null,null,null,null,null,null,"zz nueva solución: Fase: : introducir valores",0,0,0,0,0,0,0,0,0,0,0,0,0,0,0,0]
["zz nueva solución",": introducir valores",0,null,null,null,null,null,null,null,null,null,null,null,null,null,null,null,"",null,null,null,null,0,null,"zz nueva solución: fase : introducir valores",34,null,null,null,null,null,null,null,null,null,null,null,null,null,null,null,null,null,null,null,null,null,null,null,null,null,"zz nueva solución: Fase: : introducir valores",0,0,0,0,0,0,0,0,0,0,0,0,0,0,0,0]
["zz nueva solución",": introducir valores",0,null,null,null,null,null,null,null,null,null,null,null,null,null,null,null,"",null,null,null,null,0,null,"zz nueva solución: fase : introducir valores",35,null,null,null,null,null,null,null,null,null,null,null,null,null,null,null,null,null,null,null,null,null,null,null,null,null,"zz nueva solución: Fase: : introducir valores",0,0,0,0,0,0,0,0,0,0,0,0,0,0,0,0]
["zz nueva solución",": introducir valores",0,null,null,null,null,null,null,null,null,null,null,null,null,null,null,null,"",null,null,null,null,0,null,"zz nueva solución: fase : introducir valores",36,null,null,null,null,null,null,null,null,null,null,null,null,null,null,null,null,null,null,null,null,null,null,null,null,null,"zz nueva solución: Fase: : introducir valores",0,0,0,0,0,0,0,0,0,0,0,0,0,0,0,0]
["zz nueva solución",": introducir valores",0,null,null,null,null,null,null,null,null,null,null,null,null,null,null,null,"",null,null,null,null,0,null,"zz nueva solución: fase : introducir valores",37,null,null,null,null,null,null,null,null,null,null,null,null,null,null,null,null,null,null,null,null,null,null,null,null,null,"zz nueva solución: Fase: : introducir valores",0,0,0,0,0,0,0,0,0,0,0,0,0,0,0,0]
["zz nueva solución",": introducir valores",0,null,null,null,null,null,null,null,null,null,null,null,null,null,null,null,"",null,null,null,null,0,null,"zz nueva solución: fase : introducir valores",38,null,null,null,null,null,null,null,null,null,null,null,null,null,null,null,null,null,null,null,null,null,null,null,null,null,"zz nueva solución: Fase: : introducir valores",0,0,0,0,0,0,0,0,0,0,0,0,0,0,0,0]
["zz nueva solución",": introducir valores",0,null,null,null,null,null,null,null,null,null,null,null,null,null,null,null,"",null,null,null,null,0,null,"zz nueva solución: fase : introducir valores",39,null,null,null,null,null,null,null,null,null,null,null,null,null,null,null,null,null,null,null,null,null,null,null,null,null,"zz nueva solución: Fase: : introducir valores",0,0,0,0,0,0,0,0,0,0,0,0,0,0,0,0]
["zz nueva solución",": introducir valores",0,null,null,null,null,null,null,null,null,null,null,null,null,null,null,null,"",null,null,null,null,0,null,"zz nueva solución: fase : introducir valores",40,null,null,null,null,null,null,null,null,null,null,null,null,null,null,null,null,null,null,null,null,null,null,null,null,null,"zz nueva solución: Fase: : introducir valores",0,0,0,0,0,0,0,0,0,0,0,0,0,0,0,0]
["zz nueva solución",": introducir valores",0,null,null,null,null,null,null,null,null,null,null,null,null,null,null,null,"",null,null,null,null,0,null,"zz nueva solución: fase : introducir valores",41,null,null,null,null,null,null,null,null,null,null,null,null,null,null,null,null,null,null,null,null,null,null,null,null,null,"zz nueva solución: Fase: : introducir valores",0,0,0,0,0,0,0,0,0,0,0,0,0,0,0,0]
["zz nueva solución",": introducir valores",0,null,null,null,null,null,null,null,null,null,null,null,null,null,null,null,"",null,null,null,null,0,null,"zz nueva solución: fase : introducir valores",42,null,null,null,null,null,null,null,null,null,null,null,null,null,null,null,null,null,null,null,null,null,null,null,null,null,"zz nueva solución: Fase: : introducir valores",0,0,0,0,0,0,0,0,0,0,0,0,0,0,0,0]
["zz nueva solución",": introducir valores",0,null,null,null,null,null,null,null,null,null,null,null,null,null,null,null,"",null,null,null,null,0,null,"zz nueva solución: fase : introducir valores",43,null,null,null,null,null,null,null,null,null,null,null,null,null,null,null,null,null,null,null,null,null,null,null,null,null,"zz nueva solución: Fase: : introducir valores",0,0,0,0,0,0,0,0,0,0,0,0,0,0,0,0]
["zz nueva solución",": introducir valores",0,null,null,null,null,null,null,null,null,null,null,null,null,null,null,null,"",null,null,null,null,0,null,"zz nueva solución: fase : introducir valores",44,null,null,null,null,null,null,null,null,null,null,null,null,null,null,null,null,null,null,null,null,null,null,null,null,null,"zz nueva solución: Fase: : introducir valores",0,0,0,0,0,0,0,0,0,0,0,0,0,0,0,0]
["zz nueva solución",": introducir valores",0,null,null,null,null,null,null,null,null,null,null,null,null,null,null,null,"",null,null,null,null,0,null,"zz nueva solución: fase : introducir valores",45,null,null,null,null,null,null,null,null,null,null,null,null,null,null,null,null,null,null,null,null,null,null,null,null,null,"zz nueva solución: Fase: : introducir valores",0,0,0,0,0,0,0,0,0,0,0,0,0,0,0,0]
["zz nueva solución",": introducir valores",0,null,null,null,null,null,null,null,null,null,null,null,null,null,null,null,"",null,null,null,null,0,null,"zz nueva solución: fase : introducir valores",46,null,null,null,null,null,null,null,null,null,null,null,null,null,null,null,null,null,null,null,null,null,null,null,null,null,"zz nueva solución: Fase: : introducir valores",0,0,0,0,0,0,0,0,0,0,0,0,0,0,0,0]
["zz nueva solución",": introducir valores",0,null,null,null,null,null,null,null,null,null,null,null,null,null,null,null,"",null,null,null,null,0,null,"zz nueva solución: fase : introducir valores",47,null,null,null,null,null,null,null,null,null,null,null,null,null,null,null,null,null,null,null,null,null,null,null,null,null,"zz nueva solución: Fase: : introducir valores",0,0,0,0,0,0,0,0,0,0,0,0,0,0,0,0]
["zz nueva solución",": introducir valores",0,null,null,null,null,null,null,null,null,null,null,null,null,null,null,null,"",null,null,null,null,0,null,"zz nueva solución: fase : introducir valores",48,null,null,null,null,null,null,null,null,null,null,null,null,null,null,null,null,null,null,null,null,null,null,null,null,null,"zz nueva solución: Fase: : introducir valores",0,0,0,0,0,0,0,0,0,0,0,0,0,0,0,0]
["zz nueva solución",": introducir valores",0,null,null,null,null,null,null,null,null,null,null,null,null,null,null,null,"",null,null,null,null,0,null,"zz nueva solución: fase : introducir valores",49,null,null,null,null,null,null,null,null,null,null,null,null,null,null,null,null,null,null,null,null,null,null,null,null,null,"zz nueva solución: Fase: : introducir valores",0,0,0,0,0,0,0,0,0,0,0,0,0,0,0,0]
["zz nueva solución",": introducir valores",0,null,null,null,null,null,null,null,null,null,null,null,null,null,null,null,"",null,null,null,null,0,null,"zz nueva solución: fase : introducir valores",50,null,null,null,null,null,null,null,null,null,null,null,null,null,null,null,null,null,null,null,null,null,null,null,null,null,"zz nueva solución: Fase: : introducir valores",0,0,0,0,0,0,0,0,0,0,0,0,0,0,0,0]

{"sheet":"Calcolo","index":5,"n_rows":85,"n_cols":53,"rows_kept":85,"cut":false,"hidden":false,"merged":[[72,7,72,8],[5,9,5,12],[1,9,1,12],[1,14,1,17],[3,9,3,12],[3,14,3,17],[5,14,5,17]]}
[null,"Cálculo",null,null,null,"?"]
[null,null,null,null,null,null,null,null,null,"Guía rápida de inicio",null,null,null,null,"Conversor de unidades (ppm>mM)"]
[]
[null,null,null,null,null,null,null,null,null,"Soluciónes nutritivas",null,null,null,null,"Fertilizantes y ácidos"]
[]
[null,null,null,null,null,null,null,null,null,"Informe",null,null,null,null,"Entrada"]
[]
[null,"CALCULO MANUAL",null,null,null,null,null,null,null,null,null,null,null,null,null,null,null,null,null,null,null,null,null,null,null,null,null,null,null,null,null,null,null,null,null,null,null,null,null,null,null,null,null,null,null,null,null,null,null,null,null,null,"N"]
[null,null,null,null,null,"HCO3-(mE)","N-NO3","N-NH4","P","K","Ca","Mg","Na","S-SO4","Cl","Fe","B","Cu","Zn","Mn","Mo",null,null,null,null,null,null,null,null,null,null,null,null,null,null,null,null,null,null,null,null,null,null,null,null,null,null,null,null,null,null,null,"S"]
[null,"AGUA DE RIEGO (mmol/L)",null,null,null,{"$f":"Parametri!C18","v":2.25},{"$f":"Parametri!D18","v":0.66},{"$f":"Parametri!E18","v":0},{"$f":"Parametri!F18","v":0.01},{"$f":"Parametri!G18","v":0.08},{"$f":"Parametri!H18","v":2.4},{"$f":"Parametri!I18","v":1.89},{"$f":"Parametri!J18","v":0.47},{"$f":"Parametri!K18","v":1.59},{"$f":"Parametri!L18","v":2.99},{"$f":"Parametri!M18","v":3.6},{"$f":"Parametri!N18","v":20.399999999999999},{"$f":"Parametri!O18","v":0},{"$f":"Parametri!P18","v":0},{"$f":"Parametri!Q18","v":1.6},{"$f":"Parametri!R18","v":0}]
[null,"SOLUCION NUTRITIVA CONSIGNA (mmol/L)",null,null,null,{"$f":"F10-(Parametri!$C$18/(1+10^(Parametri!$B$42-6.35)))","v":1.3173720270115719},{"$f":"Parametri!C48","v":8},{"$f":"Parametri!D48","v":1.5},{"$f":"Parametri!E48","v":1},{"$f":"Parametri!F48","v":3},{"$f":"Parametri!G48","v":2.5},{"$f":"Parametri!H48","v":1.9},{"$f":"Parametri!I48","v":0.47},{"$f":"Parametri!J48","v":2},{"$f":"Parametri!K48","v":2.99},{"$f":"Parametri!L48","v":10},{"$f":"Parametri!M48","v":20.399999999999999},{"$f":"Parametri!N48","v":0.05},{"$f":"Parametri!O48","v":0.05},{"$f":"Parametri!P48","v":4.5999999999999996},{"$f":"Parametri!Q48","v":0.4}]
[null,"SOLUCION NUTRITIVA CALCULADA (mmol/L)",null,null,null,{"$f":"F10-((F17*'Acidi & concimi'!G10*('Acidi & concimi'!I10/100/14.007*1000))+(F18*'Acidi & concimi'!G11*('Acidi & concimi'!K11*0.4365/100/30.974*1000))+(F19*'Acidi & concimi'!G12*('Acidi & concimi'!P12*0.4005/100/16.032*1000))+(F20*'Acidi & concimi'!G13*('Acidi & concimi'!Q13/100/35.453*1000)))","v":1.3173720270115719},{"$f":"SUM(G17:G71)+G10","v":8},1.5,1,6.6365432150283503,2.5,1.9,0.47,1.9729245508692492,3.0898775740959854,10,20.909173789173789,1.7306300308660653E-2,2.5232839965174014E-2,4.6027722550474639,0.22924760492243559]
[null,"DIFERENCIA (mmol/L)",null,null,null,{"$f":"-F12+F11","v":0},{"$f":"G12-G11","v":0},0,0,3.6365432150283503,0,0,0,-2.7075449130750773E-2,9.9877574095985189E-2,0,0.50917378917378997,-3.2693699691339353E-2,{"$f":"S12-S11","v":-2.4767160034825989E-2},{"$f":"T12-T11","v":2.772255047464256E-3},{"$f":"U12-U11","v":-0.17075239507756443}]
[]
[null,"1) Neutralización de carbonatos",null,null,null,null,{"$f":"IF((F$13<-0.01),\"¡Necesita ácido!\",IF((F$13>0.01),\"Reducir el aporte de ácidos\",\"OK\"))","v":"OK"}]
[null,null,"Unit","Recomen-dación",null,"Entrada"]
["S",{"$f":"'Acidi & concimi'!B10","v":"Ácido nítrico"},"ml/L",{"$f":"-F13/('Acidi & concimi'!I10/100/14.007*1000)/'Acidi & concimi'!G10","v":0},{"$f":"IF(A17=\"S\",IF(A18=\"S\",IF(A19=\"S\",IF(D17>0,D17/3,0),IF(D17>0,D17/2,0)),IF(A19=\"S\",IF(D17>0,D17/2,0),IF(D17>0,D17,0))),0)","v":0},6.5031059544295486E-2,{"$f":"$F17*'Acidi & concimi'!G10*'Acidi & concimi'!AI10*1000","v":0.93262797298842792}]
["N",{"$f":"'Acidi & concimi'!B11","v":"Ácido fosfórico"},"ml/L",{"$f":"-F13/('Acidi & concimi'!K11*0.4365/100/30.974*1000)/'Acidi & concimi'!G11","v":0},{"$f":"IF(A18=\"S\",IF(A19=\"S\",IF(A20=\"S\",IF(D18>0,D18/3,0),IF(D18>0,D18/2,0)),IF(A20=\"S\",IF(D18>0,D18/2,0),IF(D18>0,D18,0))),0)","v":0},0,null,null,{"$f":"$F18*'Acidi & concimi'!G11*'Acidi & concimi'!AK11*1000","v":0}]
["N",{"$f":"'Acidi & concimi'!B12","v":"Ácido sulfúrico"},"ml/L",{"$f":"-F13/('Acidi & concimi'!P12*0.4005/100/16.032*1000)/'Acidi & concimi'!G12","v":0},{"$f":"IF(A19=\"S\",IF(A20=\"S\",IF(A21=\"S\",IF(D19>0,D19/3,0),IF(D19>0,D19/2,0)),IF(A21=\"S\",IF(D19>0,D19/2,0),IF(D19>0,D19,0))),0)","v":0},0,null,null,null,null,null,null,null,{"$f":"$F19*'Acidi & concimi'!G12*'Acidi & concimi'!AP12*1000","v":0}]
[null,{"$f":"'Acidi & concimi'!B13","v":"Ácido clorhídrico"},"ml/L",{"$f":"-F13/('Acidi & concimi'!Q13/100/35.453*1000)/'Acidi & concimi'!G13","v":0},{"$f":"IF(A20=\"S\",IF(A21=\"S\",IF(A22=\"S\",D20/3,D20/2),IF(A22=\"S\",D20/2,D20)),0)","v":0},null,null,null,null,null,null,null,null,null,{"$f":"$F20*'Acidi & concimi'!G13*'Acidi & concimi'!AQ13*1000","v":0}]
[]
[]
[null,"Fertilizante  pre-mezclado"]
[null,{"$f":"'Acidi & concimi'!B16","v":"Fertilizante soluble 1"},"mg/L",{"$f":"-$I$13/'Acidi & concimi'!AK16","v":{"$error":"#DIV/0!"}},null,null,{"$f":"$F24*'Acidi & concimi'!AI16","v":0},{"$f":"$F24*'Acidi & concimi'!AJ16","v":0},{"$f":"$F24*'Acidi & concimi'!AK16","v":0},{"$f":"$F24*'Acidi & concimi'!AL16","v":0},{"$f":"$F24*'Acidi & concimi'!AM16","v":0},{"$f":"$F24*'Acidi & concimi'!AN16","v":0},{"$f":"$F24*'Acidi & concimi'!AO16","v":0},{"$f":"$F24*'Acidi & concimi'!AP16","v":0},{"$f":"$F24*'Acidi & concimi'!AQ16","v":0},{"$f":"$F24*'Acidi & concimi'!AR16*1000","v":0},{"$f":"$F24*'Acidi & concimi'!AS16*1000","v":0},{"$f":"$F24*'Acidi & concimi'!AT16*1000","v":0},{"$f":"$F24*'Acidi & concimi'!AU16*1000","v":0},{"$f":"$F24*'Acidi & concimi'!AV16*1000","v":0},{"$f":"$F24*'Acidi & concimi'!AW16*1000","v":0}]
[null,{"$f":"'Acidi & concimi'!B17","v":"Fertilizante soluble 2"},"mg/L",{"$f":"-$I$13/'Acidi & concimi'!AK17","v":{"$error":"#DIV/0!"}},null,null,{"$f":"$F25*'Acidi & concimi'!AI17","v":0},{"$f":"$F25*'Acidi & concimi'!AJ17","v":0},{"$f":"$F25*'Acidi & concimi'!AK17","v":0},{"$f":"$F25*'Acidi & concimi'!AL17","v":0},{"$f":"$F25*'Acidi & concimi'!AM17","v":0},{"$f":"$F25*'Acidi & concimi'!AN17","v":0},{"$f":"$F25*'Acidi & concimi'!AO17","v":0},{"$f":"$F25*'Acidi & concimi'!AP17","v":0},{"$f":"$F25*'Acidi & concimi'!AQ17","v":0},{"$f":"$F25*'Acidi & concimi'!AR17*1000","v":0},{"$f":"$F25*'Acidi & concimi'!AS17*1000","v":0},{"$f":"$F25*'Acidi & concimi'!AT17*1000","v":0},{"$f":"$F25*'Acidi & concimi'!AU17*1000","v":0},{"$f":"$F25*'Acidi & concimi'!AV17*1000","v":0},{"$f":"$F25*'Acidi & concimi'!AW17*1000","v":0}]
[null,{"$f":"'Acidi & concimi'!B18","v":"Fertilizante soluble 3"},"mg/L",{"$f":"-$I$13/'Acidi & concimi'!AK18","v":{"$error":"#DIV/0!"}},null,null,{"$f":"$F26*'Acidi & concimi'!AI18","v":0},{"$f":"$F26*'Acidi & concimi'!AJ18","v":0},{"$f":"$F26*'Acidi & concimi'!AK18","v":0},{"$f":"$F26*'Acidi & concimi'!AL18","v":0},{"$f":"$F26*'Acidi & concimi'!AM18","v":0},{"$f":"$F26*'Acidi & concimi'!AN18","v":0},{"$f":"$F26*'Acidi & concimi'!AO18","v":0},{"$f":"$F26*'Acidi & concimi'!AP18","v":0},{"$f":"$F26*'Acidi & concimi'!AQ18","v":0},{"$f":"$F26*'Acidi & concimi'!AR18*1000","v":0},{"$f":"$F26*'Acidi & concimi'!AS18*1000","v":0},{"$f":"$F26*'Acidi & concimi'!AT18*1000","v":0},{"$f":"$F26*'Acidi & concimi'!AU18*1000","v":0},{"$f":"$F26*'Acidi & concimi'!AV18*1000","v":0},{"$f":"$F26*'Acidi & concimi'!AW18*1000","v":0}]
[]
[null,"3) ) Calcio",null,null,null,{"$f":"IF((K$10-K$11)>0.1,\"¡High calcium content in the water!!\",IF((K$13<-0.10501),\"¡Añadir más sales de calcio!\",IF((K$13>0.105),\"Reducir las sales de calcio\",\"OK\")))","v":"OK"}]
["S",{"$f":"'Acidi & concimi'!B20","v":"Nitrato cálcico"},"mg/L",{"$f":"-$K$13/'Acidi & concimi'!AM20","v":0},{"$f":"IF(A29=\"S\",IF(A30=\"s\",IF(A31=\"S\",IF(D29>0,D29/3,0),IF(D29>0,D29/2,0)),IF(A31=\"S\",IF(D29>0,D29/2,0),IF(D29>0,D29,0))),0)","v":0},10.779989241527712,{"$f":"$F29*'Acidi & concimi'!AI20","v":0.11005486267855094},{"$f":"$F29*'Acidi & concimi'!AJ20","v":1.0004987516231903E-2},{"$f":"$F29*'Acidi & concimi'!AK20","v":0},{"$f":"$F29*'Acidi & concimi'!AL20","v":0},{"$f":"$F29*'Acidi & concimi'!AM20","v":5.0000000000000044E-2},{"$f":"$F29*'Acidi & concimi'!AN20","v":0},{"$f":"$F29*'Acidi & concimi'!AO20","v":0},{"$f":"$F29*'Acidi & concimi'!AP20","v":0},{"$f":"$F29*'Acidi & concimi'!AQ20","v":0},{"$f":"$F29*'Acidi & concimi'!AR20*1000","v":0},{"$f":"$F29*'Acidi & concimi'!AS20*1000","v":0},{"$f":"$F29*'Acidi & concimi'!AT20*1000","v":0},{"$f":"$F29*'Acidi & concimi'!AU20*1000","v":0},{"$f":"$F29*'Acidi & concimi'!AV20*1000","v":0},{"$f":"$F29*'Acidi & concimi'!AW20*1000","v":0}]
["N",{"$f":"'Acidi & concimi'!B21","v":"Nitrato cálcico puro"},"mg/L",{"$f":"-$K$13/'Acidi & concimi'!AM21","v":0},{"$f":"IF(A30=\"S\",IF(A31=\"S\",IF(D30>0,D30/2,0),IF(D30>0,D30,0)),0)","v":0},0,{"$f":"$F30*'Acidi & concimi'!AI21","v":0},{"$f":"$F30*'Acidi & concimi'!AJ21","v":0},{"$f":"$F30*'Acidi & concimi'!AK21","v":0},{"$f":"$F30*'Acidi & concimi'!AL21","v":0},{"$f":"$F30*'Acidi & concimi'!AM21","v":0},{"$f":"$F30*'Acidi & concimi'!AN21","v":0},{"$f":"$F30*'Acidi & concimi'!AO21","v":0},{"$f":"$F30*'Acidi & concimi'!AP21","v":0},{"$f":"$F30*'Acidi & concimi'!AQ21","v":0},{"$f":"$F30*'Acidi & concimi'!AR21*1000","v":0},{"$f":"$F30*'Acidi & concimi'!AS21*1000","v":0},{"$f":"$F30*'Acidi & concimi'!AT21*1000","v":0},{"$f":"$F30*'Acidi & concimi'!AU21*1000","v":0},{"$f":"$F30*'Acidi & concimi'!AV21*1000","v":0},{"$f":"$F30*'Acidi & concimi'!AW21*1000","v":0}]
["S",{"$f":"'Acidi & concimi'!B22","v":"Cloruro cálcico"},"mg/L",{"$f":"-$K$13/'Acidi & concimi'!AM22","v":0},{"$f":"IF(A31=\"S\",IF(D31>0,D31,0),0)","v":0},5.5500934708855301,{"$f":"$F31*'Acidi & concimi'!AI22","v":0},{"$f":"$F31*'Acidi & concimi'!AJ22","v":0},{"$f":"$F31*'Acidi & concimi'!AK22","v":0},{"$f":"$F31*'Acidi & concimi'!AL22","v":0},{"$f":"$F31*'Acidi & concimi'!AM22","v":4.9999999999999822E-2},{"$f":"$F31*'Acidi & concimi'!AN22","v":0},{"$f":"$F31*'Acidi & concimi'!AO22","v":0},{"$f":"$F31*'Acidi & concimi'!AP22","v":0},{"$f":"$F31*'Acidi & concimi'!AQ22","v":9.9877574095985314E-2},{"$f":"$F31*'Acidi & concimi'!AR22*1000","v":0},{"$f":"$F31*'Acidi & concimi'!AS22*1000","v":0},{"$f":"$F31*'Acidi & concimi'!AT22*1000","v":0},{"$f":"$F31*'Acidi & concimi'!AU22*1000","v":0},{"$f":"$F31*'Acidi & concimi'!AV22*1000","v":0},{"$f":"$F31*'Acidi & concimi'!AW22*1000","v":0}]
[]
[null,"4) Amonio",null,null,null,{"$f":"IF((H$10-H$11)>1,\"Acqua troppo ricca di ammonio!!\",IF((H$13<-0.10501),\"Necesita añadir sales de amonio\",IF((H$13>0.105),\"Reducir sales de amonio\",\"OK\")))","v":"OK"}]
["N",{"$f":"'Acidi & concimi'!B24","v":"Nitrato amónico"},"mg/L",{"$f":"-$H$13/'Acidi & concimi'!AJ24","v":0},{"$f":"IF(A34=\"S\",IF(A35=\"s\",IF(A36=\"S\",IF(D34>0,D34/3,0),IF(D34>0,D34/2,0)),IF(A36=\"S\",IF(D34>0,D34/2,0),IF(D34>0,D34,0))),0)","v":0},0,{"$f":"$F34*'Acidi & concimi'!AI24","v":0},{"$f":"$F34*'Acidi & concimi'!AJ24","v":0},{"$f":"$F34*'Acidi & concimi'!AK24","v":0},{"$f":"$F34*'Acidi & concimi'!AL24","v":0},{"$f":"$F34*'Acidi & concimi'!AM24","v":0},{"$f":"$F34*'Acidi & concimi'!AN24","v":0},{"$f":"$F34*'Acidi & concimi'!AO24","v":0},{"$f":"$F34*'Acidi & concimi'!AP24","v":0},{"$f":"$F34*'Acidi & concimi'!AQ24","v":0},{"$f":"$F34*'Acidi & concimi'!AR24*1000","v":0},{"$f":"$F34*'Acidi & concimi'!AS24*1000","v":0},{"$f":"$F34*'Acidi & concimi'!AT24*1000","v":0},{"$f":"$F34*'Acidi & concimi'!AU24*1000","v":0},{"$f":"$F34*'Acidi & concimi'!AV24*1000","v":0},{"$f":"$F34*'Acidi & concimi'!AW18*1000","v":0}]
["S",{"$f":"'Acidi & concimi'!B25","v":"Sulfato amónico"},"mg/L",{"$f":"-$H$13/'Acidi & concimi'!AJ25","v":0},{"$f":"IF(A35=\"S\",IF(A36=\"S\",IF(D35>0,D35/2,0),IF(D35>0,D35,0)),0)","v":0},49.222547499670142,{"$f":"$F35*'Acidi & concimi'!AI25","v":0},{"$f":"$F35*'Acidi & concimi'!AJ25","v":0.7449975062418841},{"$f":"$F35*'Acidi & concimi'!AK25","v":0},{"$f":"$F35*'Acidi & concimi'!AL25","v":0},{"$f":"$F35*'Acidi & concimi'!AM25","v":0},{"$f":"$F35*'Acidi & concimi'!AN25","v":0},{"$f":"$F35*'Acidi & concimi'!AO25","v":0},{"$f":"$F35*'Acidi & concimi'!AP25","v":0.37286079731000138},{"$f":"$F35*'Acidi & concimi'!AQ25","v":0},{"$f":"$F35*'Acidi & concimi'!AR24*1000","v":0},{"$f":"$F35*'Acidi & concimi'!AS24*1000","v":0},{"$f":"$F35*'Acidi & concimi'!AT24*1000","v":0},{"$f":"$F35*'Acidi & concimi'!AU24*1000","v":0},{"$f":"$F35*'Acidi & concimi'!AV24*1000","v":0},{"$f":"$F35*'Acidi & concimi'!AW24*1000","v":0}]
["S",{"$f":"'Acidi & concimi'!B26","v":"Fosfato monoamónico"},"mg/L",{"$f":"-$H$13/'Acidi & concimi'!AJ26","v":0},{"$f":"IF(A36=\"S\",IF(D36>0,D36,0),0)","v":0},85.534262868279257,{"$f":"$F36*'Acidi & concimi'!AI26","v":0},{"$f":"$F36*'Acidi & concimi'!AJ26","v":0.74499750624188399},{"$f":"$F36*'Acidi & concimi'!AK26","v":0.74234925506817695},{"$f":"$F36*'Acidi & concimi'!AL26","v":0},{"$f":"$F36*'Acidi & concimi'!AM26","v":0},{"$f":"$F36*'Acidi & concimi'!AN26","v":0},{"$f":"$F36*'Acidi & concimi'!AO26","v":0},{"$f":"$F36*'Acidi & concimi'!AP26","v":0},{"$f":"$F36*'Acidi & concimi'!AQ26","v":0},{"$f":"$F36*'Acidi & concimi'!AR25*1000","v":0},{"$f":"$F36*'Acidi & concimi'!AS25*1000","v":0},{"$f":"$F36*'Acidi & concimi'!AT25*1000","v":0},{"$f":"$F36*'Acidi & concimi'!AU25*1000","v":0},{"$f":"$F36*'Acidi & concimi'!AV25*1000","v":0},{"$f":"$F36*'Acidi & concimi'!AW25*1000","v":0}]
[]
[null,"5) Fósforo",null,null,null,{"$f":"IF((I$10-I$11)>1,\"Acqua troppo ricca di fosforo!!\",IF((I$13<-0.10501),\"¡Necesita añadir sales de fósforo!\",IF((($I$13)^2)>0.011027,\"Reducir sales de fósforo, no usar ácido fosfórico\",\"OK\")))","v":"OK"}]
["S",{"$f":"'Acidi & concimi'!B28","v":"Fosfato monopotásico"},"mg/L",{"$f":"-$I$13/'Acidi & concimi'!AK28","v":0},{"$f":"IF(A39=\"S\",IF(D39>0,D39,0),0)","v":0},33.672990496601798,{"$f":"$F39*'Acidi & concimi'!AI28","v":0},{"$f":"$F39*'Acidi & concimi'!AJ28","v":0},{"$f":"$F39*'Acidi & concimi'!AK28","v":0.24765074493182307},{"$f":"$F39*'Acidi & concimi'!AL28","v":0.24731993378041187},{"$f":"$F39*'Acidi & concimi'!AM28","v":0},{"$f":"$F39*'Acidi & concimi'!AN28","v":0},{"$f":"$F39*'Acidi & concimi'!AO28","v":0},{"$f":"$F39*'Acidi & concimi'!AP28","v":0},{"$f":"$F39*'Acidi & concimi'!AQ28","v":0},{"$f":"$F39*'Acidi & concimi'!AR28*1000","v":0},{"$f":"$F39*'Acidi & concimi'!AS28*1000","v":0},{"$f":"$F39*'Acidi & concimi'!AT28*1000","v":0},{"$f":"$F39*'Acidi & concimi'!AU28*1000","v":0},{"$f":"$F39*'Acidi & concimi'!AV28*1000","v":0},{"$f":"$F39*'Acidi & concimi'!AW28*1000","v":0}]
[]
[null,"6) Magnesio",null,null,null,{"$f":"IF((L$10-L$11)>1,\"Acqua troppo ricca di Mg!!\",IF((L$13<-0.10501),\"¡Necesita añadir sales de magnesio!\",IF((L$13>0.105),\"Reducir sales de magnesio\",\"OK\")))","v":"OK"}]
["S",{"$f":"'Acidi & concimi'!B30","v":"Sulfato de magnesio"},"mg/L",{"$f":"-$L$13/'Acidi & concimi'!AN30","v":0},{"$f":"IF(A42=\"S\",IF(A43=\"S\",IF(D42>0,D42/2,0),IF(D42>0,D42,0)),0)","v":0},2.5357489283144052,{"$f":"$F42*'Acidi & concimi'!AI30","v":0},{"$f":"$F42*'Acidi & concimi'!AJ30","v":0},{"$f":"$F42*'Acidi & concimi'!AK30","v":0},{"$f":"$F42*'Acidi & concimi'!AL30","v":0},{"$f":"$F42*'Acidi & concimi'!AM30","v":0},{"$f":"$F42*'Acidi & concimi'!AN30","v":1.0000000000000009E-2},{"$f":"$F42*'Acidi & concimi'!AO30","v":0},{"$f":"$F42*'Acidi & concimi'!AP30","v":1.0063753559247796E-2},{"$f":"$F42*'Acidi & concimi'!AQ30","v":0},{"$f":"$F42*'Acidi & concimi'!AR30*1000","v":0},{"$f":"$F42*'Acidi & concimi'!AS30*1000","v":0},{"$f":"$F42*'Acidi & concimi'!AT30*1000","v":0},{"$f":"$F42*'Acidi & concimi'!AU30*1000","v":0},{"$f":"$F42*'Acidi & concimi'!AV30*1000","v":0},{"$f":"$F42*'Acidi & concimi'!AW30*1000","v":0}]
["N",{"$f":"'Acidi & concimi'!B31","v":"Nitrato de magnesio"},"mg/L",{"$f":"-$L$13/'Acidi & concimi'!AN31","v":0},{"$f":"IF(A43=\"S\",IF(D43>0,D43,0),0)","v":0},0,{"$f":"$F43*'Acidi & concimi'!AI31","v":0},{"$f":"$F43*'Acidi & concimi'!AJ31","v":0},{"$f":"$F43*'Acidi & concimi'!AK31","v":0},{"$f":"$F43*'Acidi & concimi'!AL31","v":0},{"$f":"$F43*'Acidi & concimi'!AM31","v":0},{"$f":"$F43*'Acidi & concimi'!AN31","v":0},{"$f":"$F43*'Acidi & concimi'!AO31","v":0},{"$f":"$F43*'Acidi & concimi'!AP31","v":0},{"$f":"$F43*'Acidi & concimi'!AQ31","v":0},{"$f":"$F43*'Acidi & concimi'!AR31*1000","v":0},{"$f":"$F43*'Acidi & concimi'!AS31*1000","v":0},{"$f":"$F43*'Acidi & concimi'!AT31*1000","v":0},{"$f":"$F43*'Acidi & concimi'!AU31*1000","v":0},{"$f":"$F43*'Acidi & concimi'!AV31*1000","v":0},{"$f":"$F43*'Acidi & concimi'!AW31*1000","v":0}]
[]
[null,"7) Nitrato",null,null,null,{"$f":"IF((G$10-G$11)>0.5,\"Acqua troppo ricca di nitrati!!\",IF((G$13<-0.20501),\"¡Necesita añadir nitratos!\",IF((G$13>0.205),\"Reducir nitratos o usar ácido sulfúrico\",\"OK\")))","v":"OK"}]
["S",{"$f":"'Acidi & concimi'!B33","v":"Nitrato potásico"},"mg/L",{"$f":"-$G$13/'Acidi & concimi'!AI33","v":0},{"$f":"IF(A46=\"S\",IF(D46>0,D46,0),0)","v":0},639.17769217980151,{"$f":"$F46*'Acidi & concimi'!AI33","v":6.2973171643330206},{"$f":"$F46*'Acidi & concimi'!AJ33","v":0},{"$f":"$F46*'Acidi & concimi'!AK33","v":0},{"$f":"$F46*'Acidi & concimi'!AL33","v":6.3092232812479381},{"$f":"$F46*'Acidi & concimi'!AM33","v":0},{"$f":"$F46*'Acidi & concimi'!AN33","v":0},{"$f":"$F46*'Acidi & concimi'!AO33","v":0},{"$f":"$F46*'Acidi & concimi'!AP33","v":0},{"$f":"$F46*'Acidi & concimi'!AQ33","v":0},{"$f":"$F46*'Acidi & concimi'!AR33*1000","v":0},{"$f":"$F46*'Acidi & concimi'!AS33*1000","v":0},{"$f":"$F46*'Acidi & concimi'!AT33*1000","v":0},{"$f":"$F46*'Acidi & concimi'!AU33*1000","v":0},{"$f":"$F46*'Acidi & concimi'!AV33*1000","v":0},{"$f":"$F46*'Acidi & concimi'!AW33*1000","v":0}]
[]
[null,"8) Potasio",null,null,null,{"$f":"IF((J$10-J$11)>0.1,\"Acqua troppo ricca di potassio!!\",IF((J$13<-0.10501),\"¡Necesita añadir sales de potasio!\",IF((J$13>0.105),\"Reducir sales de potasio, use más nitrato amónico o ácido nítrico\",\"OK\")))","v":"Reducir sales de potasio, use más nitrato amónico o ácido nítrico"}]
["N",{"$f":"'Acidi & concimi'!B34","v":"Sulfato potásico"},"mg/L",{"$f":"-$J$13/'Acidi & concimi'!AL34","v":-329.12940455217648},{"$f":"IF(A49=\"S\",IF(A50=\"S\",IF(D49>0,D49/2,0),IF(D49>0,D49,0)),0)","v":0},0,{"$f":"$F49*'Acidi & concimi'!AI34","v":0},{"$f":"$F49*'Acidi & concimi'!AJ34","v":0},{"$f":"$F49*'Acidi & concimi'!AK34","v":0},{"$f":"$F49*'Acidi & concimi'!AL34","v":0},{"$f":"$F49*'Acidi & concimi'!AM34","v":0},{"$f":"$F49*'Acidi & concimi'!AN34","v":0},{"$f":"$F49*'Acidi & concimi'!AO34","v":0},{"$f":"$F49*'Acidi & concimi'!AP34","v":0},{"$f":"$F49*'Acidi & concimi'!AQ34","v":0},{"$f":"$F49*'Acidi & concimi'!AR34*1000","v":0},{"$f":"$F49*'Acidi & concimi'!AS34*1000","v":0},{"$f":"$F49*'Acidi & concimi'!AT34*1000","v":0},{"$f":"$F49*'Acidi & concimi'!AU34*1000","v":0},{"$f":"$F49*'Acidi & concimi'!AV34*1000","v":0},{"$f":"$F49*'Acidi & concimi'!AW34*1000","v":0}]
["N",{"$f":"'Acidi & concimi'!B35","v":"Cloruro potásico"},"mg/L",{"$f":"-$J$13/'Acidi & concimi'!AL35","v":-280.83910667116044},{"$f":"IF(A50=\"S\",IF(D50>0,D50,0),0)","v":0},0,{"$f":"$F50*'Acidi & concimi'!AI35","v":0},{"$f":"$F50*'Acidi & concimi'!AJ35","v":0},{"$f":"$F50*'Acidi & concimi'!AK35","v":0},{"$f":"$F50*'Acidi & concimi'!AL35","v":0},{"$f":"$F50*'Acidi & concimi'!AM35","v":0},{"$f":"$F50*'Acidi & concimi'!AN35","v":0},{"$f":"$F50*'Acidi & concimi'!AO35","v":0},{"$f":"$F50*'Acidi & concimi'!AP35","v":0},{"$f":"$F50*'Acidi & concimi'!AQ35","v":0},{"$f":"$F50*'Acidi & concimi'!AR35*1000","v":0},{"$f":"$F50*'Acidi & concimi'!AS35*1000","v":0},{"$f":"$F50*'Acidi & concimi'!AT35*1000","v":0},{"$f":"$F50*'Acidi & concimi'!AU35*1000","v":0},{"$f":"$F50*'Acidi & concimi'!AV35*1000","v":0},{"$f":"$F50*'Acidi & concimi'!AW35*1000","v":0}]
[]
[null,"9) Hierro",null,null,null,{"$f":"IF((P$10-P$11)>1,\"Acqua troppo ricca di ferro!!\",IF((P$13<-1.01),\"¡Necesita añadir sales de hierro!\",IF((P$13>1.0101),\"Reducir sales de hierro\",\"OK\")))","v":"OK"}]
["S",{"$f":"'Acidi & concimi'!B37","v":"Mix micro AZ"},"mg/L",{"$f":"-$P$13/'Acidi & concimi'!AR37/1000","v":0},{"$f":"IF(A53=\"S\",IF(A54=\"s\",IF(A55=\"S\",IF(D53>0,D53/3,0),IF(D53>0,D53/2,0)),IF(A55=\"S\",IF(D53>0,D53/2,0),IF(D53>0,D53,0))),0)","v":0},5.499076923076923,{"$f":"$F53*'Acidi & concimi'!AI37","v":0},{"$f":"$F53*'Acidi & concimi'!AJ37","v":0},{"$f":"$F53*'Acidi & concimi'!AK37","v":0},{"$f":"$F53*'Acidi & concimi'!AL37","v":0},{"$f":"$F53*'Acidi & concimi'!AM37","v":0},{"$f":"$F53*'Acidi & concimi'!AN37","v":0},{"$f":"$F53*'Acidi & concimi'!AO37","v":0},{"$f":"$F53*'Acidi & concimi'!AP37","v":0},{"$f":"$F53*'Acidi & concimi'!AQ37","v":0},{"$f":"$F53*'Acidi & concimi'!AR37*1000","v":6.4},{"$f":"$F53*'Acidi & concimi'!AS37*1000","v":0.50917378917378919},{"$f":"$F53*'Acidi & concimi'!AT37*1000","v":1.7306300308660653E-2},{"$f":"$F53*'Acidi & concimi'!AU37*1000","v":2.5232839965174014E-2},{"$f":"$F53*'Acidi & concimi'!AV37*1000","v":3.0027722550474643},{"$f":"$F53*'Acidi & concimi'!AW37*1000","v":0.22924760492243559}]
["N",{"$f":"'Acidi & concimi'!B38","v":"Hierro  DPTA"},"mg/L",{"$f":"-$P$13/'Acidi & concimi'!AR38/1000","v":0},{"$f":"IF(A54=\"S\",IF(A55=\"S\",IF(D54>0,D54/2,0),IF(D54>0,D54,0)),0)","v":0},0,{"$f":"$F54*'Acidi & concimi'!AI38","v":0},{"$f":"$F54*'Acidi & concimi'!AJ38","v":0},{"$f":"$F54*'Acidi & concimi'!AK38","v":0},{"$f":"$F54*'Acidi & concimi'!AL38","v":0},{"$f":"$F54*'Acidi & concimi'!AM38","v":0},{"$f":"$F54*'Acidi & concimi'!AN38","v":0},{"$f":"$F54*'Acidi & concimi'!AO38","v":0},{"$f":"$F54*'Acidi & concimi'!AP38","v":0},{"$f":"$F54*'Acidi & concimi'!AQ38","v":0},{"$f":"$F54*'Acidi & concimi'!AR38*1000","v":0},{"$f":"$F54*'Acidi & concimi'!AS38*1000","v":0},{"$f":"$F54*'Acidi & concimi'!AT38*1000","v":0},{"$f":"$F54*'Acidi & concimi'!AU38*1000","v":0},{"$f":"$F54*'Acidi & concimi'!AV38*1000","v":0},{"$f":"$F54*'Acidi & concimi'!AW38*1000","v":0}]
["N",{"$f":"'Acidi & concimi'!B39","v":"Hierro EDDHA"},"mg/L",{"$f":"-$P$13/'Acidi & concimi'!AR39/1000","v":0},{"$f":"IF(A55=\"S\",IF(D55>0,D55,0),0)","v":0},0,{"$f":"$F55*'Acidi & concimi'!AI39","v":0},{"$f":"$F55*'Acidi & concimi'!AJ39","v":0},{"$f":"$F55*'Acidi & concimi'!AK39","v":0},{"$f":"$F55*'Acidi & concimi'!AL39","v":0},{"$f":"$F55*'Acidi & concimi'!AM39","v":0},{"$f":"$F55*'Acidi & concimi'!AN39","v":0},{"$f":"$F55*'Acidi & concimi'!AO39","v":0},{"$f":"$F55*'Acidi & concimi'!AP39","v":0},{"$f":"$F55*'Acidi & concimi'!AQ39","v":0},{"$f":"$F55*'Acidi & concimi'!AR39*1000","v":0},{"$f":"$F55*'Acidi & concimi'!AS39*1000","v":0},{"$f":"$F55*'Acidi & concimi'!AT39*1000","v":0},{"$f":"$F55*'Acidi & concimi'!AU39*1000","v":0},{"$f":"$F55*'Acidi & concimi'!AV39*1000","v":0},{"$f":"$F55*'Acidi & concimi'!AW39*1000","v":0}]
[]
[null,"10) Microelementos"]
[null,{"$f":"'Acidi & concimi'!B42","v":"Microelementos MIX 1"},"mg/L",null,null,null,{"$f":"$F58*'Acidi & concimi'!AI42","v":0},{"$f":"$F58*'Acidi & concimi'!AJ42","v":0},{"$f":"$F58*'Acidi & concimi'!AK42","v":0},{"$f":"$F58*'Acidi & concimi'!AL42","v":0},{"$f":"$F58*'Acidi & concimi'!AM42","v":0},{"$f":"$F58*'Acidi & concimi'!AN42","v":0},{"$f":"$F58*'Acidi & concimi'!AO42","v":0},{"$f":"$F58*'Acidi & concimi'!AP42","v":0},{"$f":"$F58*'Acidi & concimi'!AQ42","v":0},{"$f":"$F58*'Acidi & concimi'!AR42*1000","v":0},{"$f":"$F58*'Acidi & concimi'!AS42*1000","v":0},{"$f":"$F58*'Acidi & concimi'!AT42*1000","v":0},{"$f":"$F58*'Acidi & concimi'!AU42*1000","v":0},{"$f":"$F58*'Acidi & concimi'!AV42*1000","v":0},{"$f":"$F58*'Acidi & concimi'!AW42*1000","v":0}]
[null,{"$f":"'Acidi & concimi'!B43","v":"Microelementos MIX 2"},"mg/L",null,null,null,{"$f":"$F59*'Acidi & concimi'!AI43","v":0},{"$f":"$F59*'Acidi & concimi'!AJ43","v":0},{"$f":"$F59*'Acidi & concimi'!AK43","v":0},{"$f":"$F59*'Acidi & concimi'!AL43","v":0},{"$f":"$F59*'Acidi & concimi'!AM43","v":0},{"$f":"$F59*'Acidi & concimi'!AN43","v":0},{"$f":"$F59*'Acidi & concimi'!AO43","v":0},{"$f":"$F59*'Acidi & concimi'!AP43","v":0},{"$f":"$F59*'Acidi & concimi'!AQ43","v":0},{"$f":"$F59*'Acidi & concimi'!AR43*1000","v":0},{"$f":"$F59*'Acidi & concimi'!AS43*1000","v":0},{"$f":"$F59*'Acidi & concimi'!AT43*1000","v":0},{"$f":"$F59*'Acidi & concimi'!AU43*1000","v":0},{"$f":"$F59*'Acidi & concimi'!AV43*1000","v":0},{"$f":"$F59*'Acidi & concimi'!AW43*1000","v":0}]
["N",{"$f":"'Acidi & concimi'!B44","v":"Borax"},"mg/L",{"$f":"-$Q$13/'Acidi & concimi'!AS44/1000","v":-4.866439754935338E-2},{"$f":"IF(A60=\"S\",IF(A61=\"S\",IF(D60>0,D60/2,0),IF(D60>0,D60,0)),0)","v":0},0,{"$f":"$F60*'Acidi & concimi'!AI44","v":0},{"$f":"$F60*'Acidi & concimi'!AJ44","v":0},{"$f":"$F60*'Acidi & concimi'!AK44","v":0},{"$f":"$F60*'Acidi & concimi'!AL44","v":0},{"$f":"$F60*'Acidi & concimi'!AM44","v":0},{"$f":"$F60*'Acidi & concimi'!AN44","v":0},{"$f":"$F60*'Acidi & concimi'!AO44","v":0},{"$f":"$F60*'Acidi & concimi'!AP44","v":0},{"$f":"$F60*'Acidi & concimi'!AQ44","v":0},{"$f":"$F60*'Acidi & concimi'!AR44*1000","v":0},{"$f":"$F60*'Acidi & concimi'!AS44*1000","v":0},{"$f":"$F60*'Acidi & concimi'!AT44*1000","v":0},{"$f":"$F60*'Acidi & concimi'!AU44*1000","v":0},{"$f":"$F60*'Acidi & concimi'!AV44*1000","v":0},{"$f":"$F60*'Acidi & concimi'!AW44*1000","v":0}]
["N",{"$f":"'Acidi & concimi'!B45","v":"Ácido bórico"},"mg/L",{"$f":"-$Q$13/'Acidi & concimi'!AS45/1000","v":-3.1423296703296751E-2},{"$f":"IF(A61=\"S\",IF(D61>0,D61,0),0)","v":0},0,{"$f":"$F61*'Acidi & concimi'!AI45","v":0},{"$f":"$F61*'Acidi & concimi'!AJ45","v":0},{"$f":"$F61*'Acidi & concimi'!AK45","v":0},{"$f":"$F61*'Acidi & concimi'!AL45","v":0},{"$f":"$F61*'Acidi & concimi'!AM45","v":0},{"$f":"$F61*'Acidi & concimi'!AN45","v":0},{"$f":"$F61*'Acidi & concimi'!AO45","v":0},{"$f":"$F61*'Acidi & concimi'!AP45","v":0},{"$f":"$F61*'Acidi & concimi'!AQ45","v":0},{"$f":"$F61*'Acidi & concimi'!AR45*1000","v":0},{"$f":"$F61*'Acidi & concimi'!AS45*1000","v":0},{"$f":"$F61*'Acidi & concimi'!AT45*1000","v":0},{"$f":"$F61*'Acidi & concimi'!AU45*1000","v":0},{"$f":"$F61*'Acidi & concimi'!AV45*1000","v":0},{"$f":"$F61*'Acidi & concimi'!AW45*1000","v":0}]
["N",{"$f":"'Acidi & concimi'!B46","v":"Sulfato de cobre"},"mg/L",{"$f":"-$R$13/'Acidi & concimi'!AT46/1000","v":8.1477828054298661E-3},{"$f":"IF(A62=\"S\",IF(A63=\"S\",IF(D62>0,D62/2,0),IF(D62>0,D62,0)),0)","v":0},0,{"$f":"$F62*'Acidi & concimi'!AI46","v":0},{"$f":"$F62*'Acidi & concimi'!AJ46","v":0},{"$f":"$F62*'Acidi & concimi'!AK46","v":0},{"$f":"$F62*'Acidi & concimi'!AL46","v":0},{"$f":"$F62*'Acidi & concimi'!AM46","v":0},{"$f":"$F62*'Acidi & concimi'!AN46","v":0},{"$f":"$F62*'Acidi & concimi'!AO46","v":0},{"$f":"$F62*'Acidi & concimi'!AP46","v":0},{"$f":"$F62*'Acidi & concimi'!AQ46","v":0},{"$f":"$F62*'Acidi & concimi'!AR46*1000","v":0},{"$f":"$F62*'Acidi & concimi'!AS46*1000","v":0},{"$f":"$F62*'Acidi & concimi'!AT46*1000","v":0},{"$f":"$F62*'Acidi & concimi'!AU46*1000","v":0},{"$f":"$F62*'Acidi & concimi'!AV46*1000","v":0},{"$f":"$F62*'Acidi & concimi'!AW46*1000","v":0}]
["N",{"$f":"'Acidi & concimi'!B47","v":"Cobre quelatado (EDTA)"},"mg/L",{"$f":"-$R$13/'Acidi & concimi'!AT47/1000","v":1.3851230769230772E-2},{"$f":"IF(A63=\"S\",IF(D63>0,D63,0),0)","v":0},0,{"$f":"$F63*'Acidi & concimi'!AI47","v":0},{"$f":"$F63*'Acidi & concimi'!AJ47","v":0},{"$f":"$F63*'Acidi & concimi'!AK47","v":0},{"$f":"$F63*'Acidi & concimi'!AL47","v":0},{"$f":"$F63*'Acidi & concimi'!AM47","v":0},{"$f":"$F63*'Acidi & concimi'!AN47","v":0},{"$f":"$F63*'Acidi & concimi'!AO47","v":0},{"$f":"$F63*'Acidi & concimi'!AP47","v":0},{"$f":"$F63*'Acidi & concimi'!AQ47","v":0},{"$f":"$F63*'Acidi & concimi'!AR47*1000","v":0},{"$f":"$F63*'Acidi & concimi'!AS47*1000","v":0},{"$f":"$F63*'Acidi & concimi'!AT47*1000","v":0},{"$f":"$F63*'Acidi & concimi'!AU47*1000","v":0},{"$f":"$F63*'Acidi & concimi'!AV47*1000","v":0},{"$f":"$F63*'Acidi & concimi'!AW47*1000","v":0}]
["N",{"$f":"'Acidi & concimi'!B48","v":"Sulfato de zinc"},"mg/L",{"$f":"-$S$13/'Acidi & concimi'!AU48/1000","v":7.133378515757371E-3},{"$f":"IF(A64=\"S\",IF(A65=\"S\",IF(D64>0,D64/2,0),IF(D64>0,D64,0)),0)","v":0},0,{"$f":"$F64*'Acidi & concimi'!AI48","v":0},{"$f":"$F64*'Acidi & concimi'!AJ48","v":0},{"$f":"$F64*'Acidi & concimi'!AK48","v":0},{"$f":"$F64*'Acidi & concimi'!AL48","v":0},{"$f":"$F64*'Acidi & concimi'!AM48","v":0},{"$f":"$F64*'Acidi & concimi'!AN48","v":0},{"$f":"$F64*'Acidi & concimi'!AO48","v":0},{"$f":"$F64*'Acidi & concimi'!AP48","v":0},{"$f":"$F64*'Acidi & concimi'!AQ48","v":0},{"$f":"$F64*'Acidi & concimi'!AR48*1000","v":0},{"$f":"$F64*'Acidi & concimi'!AS48*1000","v":0},{"$f":"$F64*'Acidi & concimi'!AT48*1000","v":0},{"$f":"$F64*'Acidi & concimi'!AU48*1000","v":0},{"$f":"$F64*'Acidi & concimi'!AV48*1000","v":0},{"$f":"$F64*'Acidi & concimi'!AW48*1000","v":0}]
["N",{"$f":"'Acidi & concimi'!B49","v":"Zinc quelatado (EDTA)"},"mg/L",{"$f":"-$S$13/'Acidi & concimi'!AU49/1000","v":1.0795179487179486E-2},{"$f":"IF(A65=\"S\",IF(D65>0,D65,0),0)","v":0},0,{"$f":"$F65*'Acidi & concimi'!AI49","v":0},{"$f":"$F65*'Acidi & concimi'!AJ49","v":0},{"$f":"$F65*'Acidi & concimi'!AK49","v":0},{"$f":"$F65*'Acidi & concimi'!AL49","v":0},{"$f":"$F65*'Acidi & concimi'!AM49","v":0},{"$f":"$F65*'Acidi & concimi'!AN49","v":0},{"$f":"$F65*'Acidi & concimi'!AO49","v":0},{"$f":"$F65*'Acidi & concimi'!AP49","v":0},{"$f":"$F65*'Acidi & concimi'!AQ49","v":0},{"$f":"$F65*'Acidi & concimi'!AR49*1000","v":0},{"$f":"$F65*'Acidi & concimi'!AS49*1000","v":0},{"$f":"$F65*'Acidi & concimi'!AT49*1000","v":0},{"$f":"$F65*'Acidi & concimi'!AU49*1000","v":0},{"$f":"$F65*'Acidi & concimi'!AV49*1000","v":0},{"$f":"$F65*'Acidi & concimi'!AW49*1000","v":0}]
["N",{"$f":"'Acidi & concimi'!B50","v":"Sulfato de manganeso"},"mg/L",{"$f":"-$T$13/'Acidi & concimi'!AV50/1000","v":-4.6863905325441918E-4},{"$f":"IF(A66=\"S\",IF(A67=\"S\",IF(D66>0,D66/2,0),IF(D66>0,D66,0)),0)","v":0},0,{"$f":"$F66*'Acidi & concimi'!AI50","v":0},{"$f":"$F66*'Acidi & concimi'!AJ50","v":0},{"$f":"$F66*'Acidi & concimi'!AK50","v":0},{"$f":"$F66*'Acidi & concimi'!AL50","v":0},{"$f":"$F66*'Acidi & concimi'!AM50","v":0},{"$f":"$F66*'Acidi & concimi'!AN50","v":0},{"$f":"$F66*'Acidi & concimi'!AO50","v":0},{"$f":"$F66*'Acidi & concimi'!AP50","v":0},{"$f":"$F66*'Acidi & concimi'!AQ50","v":0},{"$f":"$F66*'Acidi & concimi'!AR50*1000","v":0},{"$f":"$F66*'Acidi & concimi'!AS50*1000","v":0},{"$f":"$F66*'Acidi & concimi'!AT50*1000","v":0},{"$f":"$F66*'Acidi & concimi'!AU50*1000","v":0},{"$f":"$F66*'Acidi & concimi'!AV50*1000","v":0},{"$f":"$F66*'Acidi & concimi'!AW50*1000","v":0}]
["N",{"$f":"'Acidi & concimi'!B51","v":"Quelato de manganeso"},"mg/L",{"$f":"-$T$13/'Acidi & concimi'!AV51/1000","v":-1.0153846153845747E-3},{"$f":"IF(A67=\"S\",IF(D67>0,D67,0),0)","v":0},0,{"$f":"$F67*'Acidi & concimi'!AI51","v":0},{"$f":"$F67*'Acidi & concimi'!AJ51","v":0},{"$f":"$F67*'Acidi & concimi'!AK51","v":0},{"$f":"$F67*'Acidi & concimi'!AL51","v":0},{"$f":"$F67*'Acidi & concimi'!AM51","v":0},{"$f":"$F67*'Acidi & concimi'!AN51","v":0},{"$f":"$F67*'Acidi & concimi'!AO51","v":0},{"$f":"$F67*'Acidi & concimi'!AP51","v":0},{"$f":"$F67*'Acidi & concimi'!AQ51","v":0},{"$f":"$F67*'Acidi & concimi'!AR51*1000","v":0},{"$f":"$F67*'Acidi & concimi'!AS51*1000","v":0},{"$f":"$F67*'Acidi & concimi'!AT51*1000","v":0},{"$f":"$F67*'Acidi & concimi'!AU51*1000","v":0},{"$f":"$F67*'Acidi & concimi'!AV51*1000","v":0},{"$f":"$F67*'Acidi & concimi'!AW51*1000","v":0}]
["N",{"$f":"'Acidi & concimi'!B52","v":"Heptamolibdato de amonio"},"mg/L",{"$f":"-$U$13/'Acidi & concimi'!AW52/1000","v":3.0117081447963802E-2},{"$f":"IF(A68=\"S\",IF(A69=\"S\",IF(D68>0,D68/2,0),IF(D68>0,D68,0)),0)","v":0},0,{"$f":"$F68*'Acidi & concimi'!AI52","v":0},{"$f":"$F68*'Acidi & concimi'!AJ52","v":0},{"$f":"$F68*'Acidi & concimi'!AK52","v":0},{"$f":"$F68*'Acidi & concimi'!AL52","v":0},{"$f":"$F68*'Acidi & concimi'!AM52","v":0},{"$f":"$F68*'Acidi & concimi'!AN52","v":0},{"$f":"$F68*'Acidi & concimi'!AO52","v":0},{"$f":"$F68*'Acidi & concimi'!AP52","v":0},{"$f":"$F68*'Acidi & concimi'!AQ52","v":0},{"$f":"$F68*'Acidi & concimi'!AR52*1000","v":0},{"$f":"$F68*'Acidi & concimi'!AS52*1000","v":0},{"$f":"$F68*'Acidi & concimi'!AT52*1000","v":0},{"$f":"$F68*'Acidi & concimi'!AU52*1000","v":0},{"$f":"$F68*'Acidi & concimi'!AV52*1000","v":0},{"$f":"$F68*'Acidi & concimi'!AW52*1000","v":0}]
["N",{"$f":"'Acidi & concimi'!B53","v":"Molibdato de sodio"},"mg/L",{"$f":"-$U$13/'Acidi & concimi'!AW53/1000","v":4.1268746366983147E-2},{"$f":"IF(A69=\"S\",IF(D69>0,D69,0),0)","v":0},0,{"$f":"$F69*'Acidi & concimi'!AI53","v":0},{"$f":"$F69*'Acidi & concimi'!AJ53","v":0},{"$f":"$F69*'Acidi & concimi'!AK53","v":0},{"$f":"$F69*'Acidi & concimi'!AL53","v":0},{"$f":"$F69*'Acidi & concimi'!AM53","v":0},{"$f":"$F69*'Acidi & concimi'!AN53","v":0},{"$f":"$F69*'Acidi & concimi'!AO53","v":0},{"$f":"$F69*'Acidi & concimi'!AP53","v":0},{"$f":"$F69*'Acidi & concimi'!AQ53","v":0},{"$f":"$F69*'Acidi & concimi'!AR53*1000","v":0},{"$f":"$F69*'Acidi & concimi'!AS53*1000","v":0},{"$f":"$F69*'Acidi & concimi'!AT53*1000","v":0},{"$f":"$F69*'Acidi & concimi'!AU53*1000","v":0},{"$f":"$F69*'Acidi & concimi'!AV53*1000","v":0},{"$f":"$F69*'Acidi & concimi'!AW53*1000","v":0}]
[null,"11) Sodio"]
["N",{"$f":"'Acidi & concimi'!B55","v":"Cloruro sódico"},"mg/L",{"$f":"-$M$13/'Acidi & concimi'!AO55","v":0},{"$f":"IF(A71=\"S\",IF(D71>0,D71,0),0)","v":0},0,{"$f":"$F71*'Acidi & concimi'!AI55","v":0},{"$f":"$F71*'Acidi & concimi'!AJ55","v":0},{"$f":"$F71*'Acidi & concimi'!AK55","v":0},{"$f":"$F71*'Acidi & concimi'!AL55","v":0},{"$f":"$F71*'Acidi & concimi'!AM55","v":0},{"$f":"$F71*'Acidi & concimi'!AN55","v":0},{"$f":"$F71*'Acidi & concimi'!AO55","v":0},{"$f":"$F71*'Acidi & concimi'!AP55","v":0},{"$f":"$F71*'Acidi & concimi'!AQ55","v":0},{"$f":"$F71*'Acidi & concimi'!AR55*1000","v":0},{"$f":"$F71*'Acidi & concimi'!AS55*1000","v":0},{"$f":"$F71*'Acidi & concimi'!AT55*1000","v":0},{"$f":"$F71*'Acidi & concimi'!AU55*1000","v":0},{"$f":"$F71*'Acidi & concimi'!AV55*1000","v":0},{"$f":"$F71*'Acidi & concimi'!AW55*1000","v":0}]
[]
[null,"Coste total de las soluciones madre",null,null,null,null,null,{"$f":"((F17*'Acidi & concimi'!H10+Calcolo!F18*'Acidi & concimi'!H11+Calcolo!F19*'Acidi & concimi'!H12+Calcolo!F20*'Acidi & concimi'!H13)/1000+(Calcolo!F24*'Acidi & concimi'!H16+Calcolo!F25*'Acidi & concimi'!H17+Calcolo!F26*'Acidi & concimi'!H18+Calcolo!F42*'Acidi & concimi'!H30+Calcolo!F43*'Acidi & concimi'!H31+Calcolo!F30*'Acidi & concimi'!H20+Calcolo!F29*'Acidi & concimi'!H21+Calcolo!F31*'Acidi & concimi'!H22+Calcolo!F34*'Acidi & concimi'!H24+Calcolo!F35*'Acidi & concimi'!H25+Calcolo!F36*'Acidi & concimi'!H26+Calcolo!F39*'Acidi & concimi'!H28+Calcolo!F46*'Acidi & concimi'!H33+Calcolo!F49*'Acidi & concimi'!H34+Calcolo!F50*'Acidi & concimi'!H35+AO85)/1000000)*(Parametri!I27*Parametri!I28)","v":71.882823673719514},null,"Euro","Relativo a Euro/m3 (de solución nutritiva aportada al cultivo):",null,null,null,null,null,null,null,null,{"$f":"H73/(Parametri!I27*Parametri!I28)*1000","v":0.47921882449146347}]
[]
[]
[]
[]
[]
[]
[]
[]
[]
[]
[]
[null,null,null,null,null,null,null,null,null,null,null,null,null,null,null,null,null,null,null,null,null,null,null,null,null,null,null,null,null,null,null,null,null,null,null,null,null,null,null,null,{"$f":"Calcolo!F53*'Acidi & concimi'!H37+Calcolo!F54*'Acidi & concimi'!H38+Calcolo!F55*'Acidi & concimi'!H39+Calcolo!F58*'Acidi & concimi'!H42+Calcolo!F59*'Acidi & concimi'!H43+Calcolo!F60*'Acidi & concimi'!H44+Calcolo!F61*'Acidi & concimi'!H45+Calcolo!F62*'Acidi & concimi'!H46+Calcolo!F63*'Acidi & concimi'!H47+Calcolo!F64*'Acidi & concimi'!H48+Calcolo!F65*'Acidi & concimi'!H49+Calcolo!F66*'Acidi & concimi'!H50+Calcolo!F67*'Acidi & concimi'!H51+Calcolo!F68*'Acidi & concimi'!H52+Calcolo!F69*'Acidi & concimi'!H53+Calcolo!F71*'Acidi & concimi'!H55","v":0}]

{"sheet":"Stampa","index":6,"n_rows":79,"n_cols":28,"rows_kept":79,"cut":false,"hidden":false,"merged":[[66,1,66,5],[64,1,64,5],[34,1,34,9],[71,1,71,5],[62,1,62,5],[46,1,46,5],[67,1,67,5],[60,1,60,5],[55,1,55,5],[69,1,69,5],[68,1,68,5],[70,1,70,5],[46,9,46,13],[61,1,61,5],[52,1,52,4],[54,1,54,5],[78,9,78,10],[75,1,75,5],[72,1,72,5],[73,1,73,5],[78,1,78,8],[74,1,74,5],[47,1,47,5],[56,1,56,5],[53,1,53,5],[63,1,63,5],[43,1,43,5],[45,1,45,5],[65,1,65,5],[57,1,57,5],[58,1,58,5],[59,1,59,5],[48,1,48,5],[49,1,49,5],[50,1,50,5],[45,9,45,13],[15,1,15,3],[15,4,15,7],[39,1,39,17],[43,9,43,13],[21,1,21,3],[44,1,44,5],[23,3,23,9],[41,1,41,4],[42,1,42,5],[44,9,44,13],[15,8,15,10],[20,1,20,3],[17,1,17,4],[18,1,18,3],[20,8,20,9],[19,8,19,9],[41,9,41,12],[19,1,19,3],[29,1,29,9],[2,14,2,17],[4,14,4,17],[6,14,6,17],[18,8,18,9],[2,9,2,12],[4,9,4,12],[6,9,6,12],[13,2,13,13],[17,8,17,12]]}
[null,null,"INFORME"]
[]
[null,"TEST DE PRECIPITACIÓN DE LA SOLUCION MADRE",null,null,null,null,null,"?",null,"Guía rápida de inicio",null,null,null,null,"Conversor de unidades (ppm>mM)"]
[]
[null,"Concentración de sales en el tanque A",null,null,null,null,{"$f":"((SUM(G43:G47)+G51)*1000+SUM(G48:G50))/Parametri!I28","v":41.598620080407876},"g/L",null,"Cálculo",null,null,null,null,"Fertilizantes y ácidos"]
[null,"Concentración de sales en el tanque B",null,null,null,null,{"$f":"(SUM(G54:G64)*1000 +SUM(G65:G76))/Parametri!I28","v":41.598620080407862},"g/L"]
[null,null,null,null,null,null,null,null,null,"Test de precipitación de la SN madre",null,null,null,null,"Entrada"]
[null,{"$f":"IF(precip_A>0,IF(precip_B>0,\"Hay \"&precip_A&\" sales precipitadas en el tanque A y \"&precip_B&\" en el tanque B\",\"Hay \"&precip_A&\" sales precipitadas en el tanque A\"),IF(precip_B>0,\"Hay \"&precip_B&\" sales precipitadas en el tanque B\",\"NO hay precipitación en los tanques de solución madre\"))","v":"NO hay precipitación en los tanques de solución madre"}]
[]
[null,null,"Introducir una nueva relación de dilución"]
[null,"1:",100]
[]
[]
[null,null,"COMPOSICION DE LA SOLUCION NUTRITIVA"]
[]
[null,"Cultivo y fase",null,null,{"$f":"Parametri!AI31","v":"FVH: Fase: 4 sem"}]
[]
[null,"Volumen de los tanques de solución madre (L):",null,null,null,{"$f":"Parametri!I28","v":1500},null,null,"Relación entre nutrientes (en meq)"]
[null,"Relación de dilución",null,null,"1:",{"$f":"Parametri!I27","v":100},null,null,"N/K",null,{"$f":"((D37+E37))/(G37)","v":1.4314681140759238}]
[null,"Consigna de pH:",null,null,null,{"$f":"Parametri!B42","v":6.5},null,null,"NH4/NO3",null,{"$f":"E37/D37","v":0.1875}]
[null,"Consigna CE (dS/m):",null,null,null,{"$f":"Parametri!I42","v":1.4981500000000001},null,null,"K:Ca: Mg",null,{"$f":"(G37)/($G$37+$H$37*2+$I$37*2)","v":0.429924182025889},{"$f":"(H37*2)/($G$37+$H$37*2+$I$37*2)","v":0.32390671475801758},{"$f":"(I37*2)/($G$37+$H$37*2+$I$37*2)","v":0.24616910321609337}]
[null,"CE esperada (dS/m):",null,null,null,{"$f":"B37","v":1.8436216054276933}]
[]
[null,"Agua de riego","?","(µM para Fe, B, Cu, Zn, Mn, Mo; mM para otros iones)"]
[null,"CE (dS/m)","HCO3-","N-NO3","N-NH4","P","K","Ca","Mg","Na","S-SO4","Cl","Fe","B","Cu","Zn","Mn","Mo"]
[null,{"$f":"Parametri!B18","v":1.05735},{"$f":"Parametri!C18","v":2.25},{"$f":"Parametri!D18","v":0.66},{"$f":"Parametri!E18","v":0},{"$f":"Parametri!F18","v":0.01},{"$f":"Parametri!G18","v":0.08},{"$f":"Parametri!H18","v":2.4},{"$f":"Parametri!I18","v":1.89},{"$f":"Parametri!J18","v":0.47},{"$f":"Parametri!K18","v":1.59},{"$f":"Parametri!L18","v":2.99},{"$f":"Parametri!M18","v":3.6},{"$f":"Parametri!N18","v":20.399999999999999},{"$f":"Parametri!O18","v":0},{"$f":"Parametri!P18","v":0},{"$f":"Parametri!Q18","v":1.6},{"$f":"Parametri!R18","v":0}]
[null,"ppm",{"$f":"C26*61","v":137.25},{"$f":"D26*14.007","v":9.2446199999999994},{"$f":"E26*14.007","v":0},{"$f":"F26*30.97","v":0.30969999999999998},{"$f":"G26*39.1","v":3.1280000000000001},{"$f":"H26*40.08","v":96.191999999999993},{"$f":"I26*24.31","v":45.945899999999995},{"$f":"J26*22.9898","v":10.805205999999998},{"$f":"K26*32","v":50.88},{"$f":"L26*35.47","v":106.0553},{"$f":"M26*55.85/1000","v":0.20105999999999999},{"$f":"N26*10.8/1000","v":0.22031999999999999},{"$f":"O26*63.55/1000","v":0},{"$f":"P26*65.38/1000","v":0},{"$f":"Q26*54.94/1000","v":8.7903999999999996E-2},{"$f":"R26*95.95/1000","v":0}]
[null,{"$f":"IF(B26<1.001,\"OK\",\"ALTO\")","v":"ALTO"},{"$f":"IF(C27<300.01,\"OK\",\"ALTO\")","v":"OK"},{"$f":"IF(D27<50.01,\"OK\",\"ALTO\")","v":"OK"},{"$f":"IF(E27<14.01,\"OK\",\"ALTO\")","v":"OK"},{"$f":"IF(F27<30.01,\"OK\",\"ALTO\")","v":"OK"},{"$f":"IF(G27<100.01,\"OK\",\"ALTO\")","v":"OK"},{"$f":"IF(H27<160.01,\"OK\",\"ALTO\")","v":"OK"},{"$f":"IF(I27<25.01,\"OK\",\"ALTO\")","v":"ALTO"},{"$f":"IF(J27<70.01,\"OK\",\"ALTO\")","v":"OK"},{"$f":"IF(K27<90.01,\"OK\",\"ALTO\")","v":"OK"},{"$f":"IF(L27<105.01,\"OK\",\"ALTO\")","v":"ALTO"},{"$f":"IF(M27>5,\"ALTO\",\"OK\")","v":"OK"},{"$f":"IF(N27<0.751,\"OK\",\"ALTO\")","v":"OK"},{"$f":"IF(O27>1,\"ALTO\",\"OK\")","v":"OK"},{"$f":"IF(P27>2,\"ALTO\",\"OK\")","v":"OK"},{"$f":"IF(Q27>0.5,\"ALTO\",\"OK\")","v":"OK"},{"$f":"IF(R27>0.2,\"ALTO\",\"OK\")","v":"OK"}]
[]
[null,"Solución seleccionada (µM para Fe, B, Cu, Zn, Mn, Mo; mM para otros iones)"]
[null,"CE (dS/m)",null,"N-NO3","N-NH4","P","K","Ca","Mg","Na","S-SO4","Cl","Fe","B","Cu","Zn","Mn","Mo"]
[null,{"$f":"Parametri!B36","v":1.4535},"mM /mM",{"$f":"Parametri!C36","v":8},{"$f":"Parametri!D36","v":1.5},{"$f":"Parametri!E36","v":1},{"$f":"Parametri!F36","v":3},{"$f":"Parametri!G36","v":2.5},{"$f":"Parametri!H36","v":1.9},{"$f":"Parametri!I36","v":0},{"$f":"Parametri!J36","v":2},{"$f":"Parametri!K36","v":0},{"$f":"Parametri!L36","v":10},{"$f":"Parametri!M36","v":0.8},{"$f":"Parametri!N36","v":0.05},{"$f":"Parametri!O36","v":0.05},{"$f":"Parametri!P36","v":4.5999999999999996},{"$f":"Parametri!Q36","v":0.4}]
[null,null,"ppm",{"$f":"D32*14.007","v":112.056},{"$f":"E32*14.007","v":21.0105},{"$f":"F32*30.97","v":30.97},{"$f":"G32*39.1","v":117.30000000000001},{"$f":"H32*40.08","v":100.19999999999999},{"$f":"I32*24.31","v":46.188999999999993},{"$f":"J32*22.9898","v":0},{"$f":"K32*32","v":64},{"$f":"L32*35.47","v":0},{"$f":"M32*55.85/1000","v":0.5585},{"$f":"N32*10.8/1000","v":8.6400000000000001E-3},{"$f":"O32*63.55/1000","v":3.1775000000000002E-3},{"$f":"P32*65.38/1000","v":3.2690000000000002E-3},{"$f":"Q32*54.94/1000","v":0.25272399999999995},{"$f":"R32*95.95/1000","v":3.8380000000000004E-2}]
[]
[null,"Solución nutritiva calculada (µM para Fe, B, Cu, Zn, Mn, Mo; mM para otros iones)"]
[null,"CE (dS/m)",null,"N-NO3","N-NH4","P","K","Ca","Mg","Na","S-SO4","Cl","Fe","B","Cu","Zn","Mn","Mo"]
[null,{"$f":"IF((E37+G37+H37*2+I37*2+J37)=0,0,(E37+G37+H37*2+I37*2+J37)*0.095+ 0.19)","v":1.8436216054276933},"mM /mM",{"$f":"Calcolo!G12","v":8},{"$f":"Calcolo!H12","v":1.5},{"$f":"Calcolo!I12","v":1},{"$f":"Calcolo!J12","v":6.6365432150283503},{"$f":"Calcolo!K12","v":2.5},{"$f":"Calcolo!L12","v":1.9},{"$f":"Calcolo!M12","v":0.47},{"$f":"Calcolo!N12","v":1.9729245508692492},{"$f":"Calcolo!O12","v":3.0898775740959854},{"$f":"Calcolo!P12","v":10},{"$f":"Calcolo!Q12","v":20.909173789173789},{"$f":"Calcolo!R12","v":1.7306300308660653E-2},{"$f":"Calcolo!S12","v":2.5232839965174014E-2},{"$f":"Calcolo!T12","v":4.6027722550474639},{"$f":"Calcolo!U12","v":0.22924760492243559}]
[null,null,"ppm",{"$f":"D37*14.007","v":112.056},{"$f":"E37*14.007","v":21.0105},{"$f":"F37*30.97","v":30.97},{"$f":"G37*39.1","v":259.48883970760852},{"$f":"H37*40.08","v":100.19999999999999},{"$f":"I37*24.31","v":46.188999999999993},{"$f":"J37*22.9898","v":10.805205999999998},{"$f":"K37*32","v":63.133585627815975},{"$f":"L37*35.47","v":109.5979575531846},{"$f":"M37*55.85/1000","v":0.5585},{"$f":"N37*10.8/1000","v":0.22581907692307693},{"$f":"O37*63.55/1000","v":1.0998153846153843E-3},{"$f":"P37*65.38/1000","v":1.6497230769230769E-3},{"$f":"Q37*54.94/1000","v":0.25287630769230762},{"$f":"R37*95.95/1000","v":2.1996307692307697E-2}]
[]
[null,"Cantidad de fertilizantes a disolver en los tanques de solución madre."]
[null,null,null,null,null,null,null,null,null,null,null,null,null,null,null,null,null,null,null,null,null,null,null,"Kg",null,"A=",{"$f":"(SUM(Calcolo!F29:F31)+Calcolo!F34+SUM(Calcolo!F53:F55)+Calcolo!F71)","v":21.829159635490168},"mg/L"]
[null,"Tanque A: ",null,null,null,null,null,null,null,"Tanque ácido:",null,null,null,null,null,null,null,null,null,null,null,null,null,"g",null,"B=",{"$f":"(SUM(Calcolo!F24:F26)+Calcolo!F35+Calcolo!F36+Calcolo!F39+Calcolo!F42+Calcolo!F43+Calcolo!F49+Calcolo!F50+SUM(Calcolo!F58:F69))","v":170.96554979286563},"mg/L"]
[null,{"$f":"IF(Calcolo!F29>0,Calcolo!B29,0)","v":"Nitrato cálcico"},null,null,null,null,{"$f":"IF(Calcolo!F29>0,Calcolo!F29*Parametri!$I$27*Parametri!$I$28/1000000,0)","v":1.6169983862291568},{"$f":"IF(Calcolo!F29>0,$X$41,0)","v":"Kg"},null,null,null,null,null,null,null,null,null,null,null,null,null,null,null,"L"]
[null,{"$f":"IF(Calcolo!F30>0,Calcolo!B29,0)","v":0},null,null,null,null,{"$f":"IF(Calcolo!F30>0,Calcolo!F30*Parametri!$I$27*Parametri!$I$28/1000000,0)","v":0},{"$f":"IF(Calcolo!F30>0,$X$41,0)","v":0},null,{"$f":"IF(Calcolo!F17>0,Calcolo!B17,0)","v":"Ácido nítrico"},null,null,null,null,{"$f":"IF(Calcolo!F17>0,Calcolo!F17*Parametri!$I$27*Parametri!$I$28/1000,0)","v":9.7546589316443217},{"$f":"IF(Calcolo!F17>0,$X$43,0)","v":"L"}]
[null,{"$f":"IF(Calcolo!F31>0,Calcolo!B31,0)","v":"Cloruro cálcico"},null,null,null,null,{"$f":"IF(Calcolo!F31>0,Calcolo!F31*Parametri!$I$27*Parametri!$I$28/1000000,0)","v":0.83251402063282953},{"$f":"IF(Calcolo!F31>0,$X$41,0)","v":"Kg"},null,{"$f":"IF(Calcolo!F18>0,Calcolo!B18,0)","v":0},null,null,null,null,{"$f":"IF(Calcolo!F18>0,Calcolo!F18*Parametri!$I$27*Parametri!$I$28/1000,0)","v":0},{"$f":"IF(Calcolo!F18>0,$X$43,0)","v":0}]
[null,{"$f":"IF(Calcolo!F34>0,Calcolo!B34,0)","v":0},null,null,null,null,{"$f":"IF(Calcolo!F34>0,Calcolo!F34*Parametri!$I$27*Parametri!$I$28/1000000,0)","v":0},{"$f":"IF(Calcolo!F34>0,$X$41,0)","v":0},null,{"$f":"IF(Calcolo!F19>0,Calcolo!B19,0)","v":0},null,null,null,null,{"$f":"IF(Calcolo!F19>0,Calcolo!F19*Parametri!$I$27*Parametri!$I$28/1000,0)","v":0},{"$f":"IF(Calcolo!F19>0,$X$43,0)","v":0}]
[null,{"$f":"IF(G47>0,Calcolo!B46,0)","v":"Nitrato potásico"},null,null,null,null,{"$f":"IF(Calcolo!F46>0,IF((AA41-AA42)>0,IF((AA41-AA42)>Calcolo!F46,0,((Calcolo!F46-(Stampa!AA41-Stampa!AA42))/2)*Parametri!$I$27*Parametri!$I$28/1000000),IF((-AA41+AA42)>Calcolo!F46,Calcolo!F46*Parametri!$I$27*Parametri!$I$28/1000000,(((Stampa!AA42-Stampa!AA41)+(Calcolo!F46-(Stampa!AA42-Stampa!AA41))/2)*Parametri!$I$27*Parametri!$I$28/1000000))),0)","v":59.123556175288286},{"$f":"IF(G47>0,$X$41,0)","v":"Kg"},null,{"$f":"IF(Calcolo!F20>0,Calcolo!B20,0)","v":0},null,null,null,null,{"$f":"IF(Calcolo!F20>0,Calcolo!F20*Parametri!$I$27*Parametri!$I$28/1000,0)","v":0},{"$f":"IF(Calcolo!F20>0,$X$43,0)","v":0}]
[null,{"$f":"IF(Calcolo!F53>0,Calcolo!B53,0)","v":"Mix micro AZ"},null,null,null,null,{"$f":"IF(Calcolo!F53>0,Calcolo!F53*Parametri!$I$27*Parametri!$I$28/1000,0)","v":824.86153846153843},{"$f":"IF(Calcolo!F53>0,$X$42,0)","v":"g"}]
[null,{"$f":"IF(Calcolo!F54>0,Calcolo!B54,0)","v":0},null,null,null,null,{"$f":"IF(Calcolo!F54>0,Calcolo!F54*Parametri!$I$27*Parametri!$I$28/1000,0)","v":0},{"$f":"IF(Calcolo!F54>0,$X$42,0)","v":0}]
[null,{"$f":"IF(Calcolo!F55>0,Calcolo!B55,0)","v":0},null,null,null,null,{"$f":"IF(Calcolo!F55>0,Calcolo!F55*Parametri!$I$27*Parametri!$I$28/1000,0)","v":0},{"$f":"IF(Calcolo!F55>0,$X$42,0)","v":0}]
[null,{"$f":"IF(Calcolo!F71>0,Calcolo!B71,0)","v":0},null,null,null,null,{"$f":"IF(Calcolo!F71>0,Calcolo!F71*Parametri!$I$27*Parametri!$I$28/1000000,0)","v":0},{"$f":"IF(Calcolo!F71>0,$X$41,0)","v":0}]
[]
[null,"Tanque B:"]
[null,{"$f":"IF(Calcolo!F24>0,Calcolo!B24,0)","v":0},null,null,null,null,{"$f":"IF(Calcolo!F24>0,Calcolo!F24*Parametri!$I$27*Parametri!$I$28/1000000,0)","v":0},{"$f":"IF(Calcolo!F24>0,$X$41,0)","v":0}]
[null,{"$f":"IF(Calcolo!F25>0,Calcolo!B25,0)","v":0},null,null,null,null,{"$f":"IF(Calcolo!F25>0,Calcolo!F25*Parametri!$I$27*Parametri!$I$28/1000000,0)","v":0},{"$f":"IF(Calcolo!F25>0,$X$41,0)","v":0}]
[null,{"$f":"IF(Calcolo!F26>0,Calcolo!B26,0)","v":0},null,null,null,null,{"$f":"IF(Calcolo!F26>0,Calcolo!F26*Parametri!$I$27*Parametri!$I$28/1000000,0)","v":0},{"$f":"IF(Calcolo!F26>0,$X$41,0)","v":0}]
[null,{"$f":"IF(Calcolo!F42>0,Calcolo!B42,0)","v":"Sulfato de magnesio"},null,null,null,null,{"$f":"IF(Calcolo!F42>0,Calcolo!F42*Parametri!$I$27*Parametri!$I$28/1000000,0)","v":0.38036233924716084},{"$f":"IF(Calcolo!F42>0,$X$41,0)","v":"Kg"}]
[null,{"$f":"IF(Calcolo!F43>0,Calcolo!B43,0)","v":0},null,null,null,null,{"$f":"IF(Calcolo!F43>0,Calcolo!F43*Parametri!$I$27*Parametri!$I$28/1000000,0)","v":0},{"$f":"IF(Calcolo!F43>0,$X$41,0)","v":0}]
[null,{"$f":"IF(Calcolo!F35>0,Calcolo!B35,0)","v":"Sulfato amónico"},null,null,null,null,{"$f":"IF(Calcolo!F35>0,Calcolo!F35*Parametri!$I$27*Parametri!$I$28/1000000,0)","v":7.383382124950522},{"$f":"IF(Calcolo!F35>0,$X$41,0)","v":"Kg"}]
[null,{"$f":"IF(G60>0,Calcolo!B36,0)","v":"Fosfato monoamónico"},null,null,null,null,{"$f":"IF(Calcolo!F36>0,Calcolo!F36*Parametri!$I$27*Parametri!$I$28/1000000,0)","v":12.830139430241889},{"$f":"IF(Calcolo!F36>0,$X$41,0)","v":"Kg"}]
[null,{"$f":"IF(Calcolo!F39>0,Calcolo!B39,0)","v":"Fosfato monopotásico"},null,null,null,null,{"$f":"IF(Calcolo!F39>0,Calcolo!F39*Parametri!$I$27*Parametri!$I$28/1000000,0)","v":5.0509485744902696},{"$f":"IF(Calcolo!F39>0,$X$41,0)","v":"Kg"}]
[null,{"$f":"IF(G62>0,Calcolo!B46,0)","v":"Nitrato potásico"},null,null,null,null,{"$f":"IF(Calcolo!F46>0,(Calcolo!F46*Parametri!$I$27*Parametri!$I$28/1000000)-G47,0)","v":36.753097651681955},{"$f":"IF(G62>0,$X$41,0)","v":"Kg"}]
[null,{"$f":"IF(Calcolo!F49>0,Calcolo!B49,0)","v":0},null,null,null,null,{"$f":"IF(Calcolo!F49>0,Calcolo!F49*Parametri!$I$27*Parametri!$I$28/1000000,0)","v":0},{"$f":"IF(Calcolo!F49>0,$X$41,0)","v":0}]
[null,{"$f":"IF(Calcolo!F50>0,Calcolo!B50,0)","v":0},null,null,null,null,{"$f":"IF(Calcolo!F50>0,Calcolo!F50*Parametri!$I$27*Parametri!$I$28/1000000,0)","v":0},{"$f":"IF(Calcolo!F50>0,$X$41,0)","v":0}]
[null,{"$f":"IF(Calcolo!F58>0,Calcolo!B58,0)","v":0},null,null,null,null,{"$f":"IF(Calcolo!F58>0,Calcolo!F58*Parametri!$I$27*Parametri!$I$28/1000,0)","v":0},{"$f":"IF(Calcolo!F58>0,$X$42,0)","v":0}]
[null,{"$f":"IF(Calcolo!F59>0,Calcolo!B59,0)","v":0},null,null,null,null,{"$f":"IF(Calcolo!F59>0,Calcolo!F59*Parametri!$I$27*Parametri!$I$28/1000,0)","v":0},{"$f":"IF(Calcolo!F59>0,$X$42,0)","v":0}]
[null,{"$f":"IF(Calcolo!F60>0,Calcolo!B60,0)","v":0},null,null,null,null,{"$f":"IF(Calcolo!F60>0,Calcolo!F60*Parametri!$I$27*Parametri!$I$28/1000,0)","v":0},{"$f":"IF(Calcolo!F60>0,$X$42,0)","v":0}]
[null,{"$f":"IF(Calcolo!F61>0,Calcolo!B61,0)","v":0},null,null,null,null,{"$f":"IF(Calcolo!F61>0,Calcolo!F61*Parametri!$I$27*Parametri!$I$28/1000,0)","v":0},{"$f":"IF(Calcolo!F61>0,$X$42,0)","v":0}]
[null,{"$f":"IF(Calcolo!F62>0,Calcolo!B62,0)","v":0},null,null,null,null,{"$f":"IF(Calcolo!F62>0,Calcolo!F62*Parametri!$I$27*Parametri!$I$28/1000,0)","v":0},{"$f":"IF(Calcolo!F62>0,$X$42,0)","v":0}]
[null,{"$f":"IF(Calcolo!F63>0,Calcolo!B63,0)","v":0},null,null,null,null,{"$f":"IF(Calcolo!F63>0,Calcolo!F63*Parametri!$I$27*Parametri!$I$28/1000,0)","v":0},{"$f":"IF(Calcolo!F63>0,$X$42,0)","v":0}]
[null,{"$f":"IF(Calcolo!F64>0,Calcolo!B64,0)","v":0},null,null,null,null,{"$f":"IF(Calcolo!F64>0,Calcolo!F64*Parametri!$I$27*Parametri!$I$28/1000,0)","v":0},{"$f":"IF(Calcolo!F64>0,$X$42,0)","v":0}]
[null,{"$f":"IF(Calcolo!F65>0,Calcolo!B65,0)","v":0},null,null,null,null,{"$f":"IF(Calcolo!F65>0,Calcolo!F65*Parametri!$I$27*Parametri!$I$28/1000,0)","v":0},{"$f":"IF(Calcolo!F65>0,$X$42,0)","v":0}]
[null,{"$f":"IF(Calcolo!F66>0,Calcolo!B66,0)","v":0},null,null,null,null,{"$f":"IF(Calcolo!F66>0,Calcolo!F66*Parametri!$I$27*Parametri!$I$28/1000,0)","v":0},{"$f":"IF(Calcolo!F66>0,$X$42,0)","v":0}]
[null,{"$f":"IF(Calcolo!F67>0,Calcolo!B67,0)","v":0},null,null,null,null,{"$f":"IF(Calcolo!F67>0,Calcolo!F67*Parametri!$I$27*Parametri!$I$28/1000,0)","v":0},{"$f":"IF(Calcolo!F67>0,$X$42,0)","v":0}]
[null,{"$f":"IF(Calcolo!F68>0,Calcolo!B68,0)","v":0},null,null,null,null,{"$f":"IF(Calcolo!F68>0,Calcolo!F68*Parametri!$I$27*Parametri!$I$28/1000,0)","v":0},{"$f":"IF(Calcolo!F68>0,$X$42,0)","v":0}]
[null,{"$f":"IF(Calcolo!F69>0,Calcolo!B69,0)","v":0},null,null,null,null,{"$f":"IF(Calcolo!F69>0,Calcolo!F69*Parametri!$I$27*Parametri!$I$28/1000,0)","v":0},{"$f":"IF(Calcolo!F69>0,$X$42,0)","v":0}]
[]
[]
[null,{"$f":"Calcolo!B73","v":"Coste total de las soluciones madre"},null,null,null,null,null,null,null,{"$f":"Calcolo!H73","v":71.882823673719514},null,"Euro","Relativo a Euro/m3 de solución nutritiva aportada al cultivo=",null,null,null,null,null,null,null,{"$f":"Calcolo!T73","v":0.47921882449146347}]

{"sheet":"Test precipitazioni","index":7,"n_rows":71,"n_cols":23,"rows_kept":71,"cut":false,"hidden":false,"merged":[[6,12,6,15],[2,7,2,10],[2,12,2,15],[4,7,4,10],[4,12,4,15],[6,7,6,10],[39,4,39,5],[1,1,2,5],[70,6,70,7],[70,9,70,10],[22,4,22,5]]}
[]
[null,"PRUEBA DE PRECIPITACIÓN DE LA SOLUCIÓN MADRE"]
[null,null,null,null,null,null,null,"Guía rápida de inicio",null,null,null,null,"Conversor de unidades (ppm>mM)"]
[]
[null,null,null,null,null,null,null,"Soluciones nutritivas",null,null,null,null,"Fertilizantes y ácidos"]
[]
[null,null,null,null,null,null,null,"Informe",null,null,null,null,"Entrada"]
[]
[]
[null,"Solución madre tanque A (g/L)"]
[null,"N-NO3","N-NH4","P-PO4","K","Ca","Mg","Na","S-SO4","Cl","Fe","B","Cu","Zn","Mn","Mo"]
["moles/L",{"$f":"(SUM(Calcolo!G29:G31)+Calcolo!G34+(Stampa!$G$47*'Acidi & concimi'!AI33*1000000/(Parametri!$I$27*Parametri!$I$28))+SUM(Calcolo!G53:G55)+Calcolo!G71)*(Parametri!$I$27)/1000+Parametri!D18/1000","v":0.39999754653247449},{"$f":"(SUM(Calcolo!H29:H31)+Calcolo!H34+(Stampa!$G$47*'Acidi & concimi'!AJ33*1000000/(Parametri!$I$27*Parametri!$I$28))+SUM(Calcolo!H53:H55)+Calcolo!H71)*(Parametri!$I$27)/1000+Parametri!E18/1000","v":1.0004987516231902E-3},{"$f":"(SUM(Calcolo!I29:I31)+Calcolo!I34+(Stampa!$G$47*'Acidi & concimi'!AK33*1000000/(Parametri!$I$27*Parametri!$I$28))+SUM(Calcolo!I53:I55)+Calcolo!I71)*(Parametri!$I$27)/1000+Parametri!F18/1000","v":1.0000000000000001E-5},{"$f":"(SUM(Calcolo!J29:J31)+Calcolo!J34+(Stampa!$G$47*'Acidi & concimi'!AL33*1000000/(Parametri!$I$27*Parametri!$I$28))+SUM(Calcolo!J53:J55)+Calcolo!J71)*(Parametri!$I$27)/1000+Parametri!G18/1000","v":0.38914626608444186},{"$f":"(SUM(Calcolo!K29:K31)+Calcolo!K34+(Stampa!$G$47*'Acidi & concimi'!AM33*1000000/(Parametri!$I$27*Parametri!$I$28))+SUM(Calcolo!K53:K55)+Calcolo!K71)*(Parametri!$I$27)/1000+Parametri!H18/1000","v":1.2399999999999986E-2},{"$f":"(SUM(Calcolo!L29:L31)+Calcolo!L34+(Stampa!$G$47*'Acidi & concimi'!AN33*1000000/(Parametri!$I$27*Parametri!$I$28))+SUM(Calcolo!L53:L55)+Calcolo!L71)*(Parametri!$I$27)/1000+Parametri!I18/1000","v":1.89E-3},{"$f":"(SUM(Calcolo!M29:M31)+Calcolo!M34+(Stampa!$G$47*'Acidi & concimi'!AO33*1000000/(Parametri!$I$27*Parametri!$I$28))+SUM(Calcolo!M53:M55)+Calcolo!M71)*(Parametri!$I$27)/1000+Parametri!J18/1000","v":4.6999999999999999E-4},{"$f":"(SUM(Calcolo!N29:N31)+Calcolo!N34+(Stampa!$G$47*'Acidi & concimi'!AP33*1000000/(Parametri!$I$27*Parametri!$I$28))+SUM(Calcolo!N53:N55)+Calcolo!N71)*(Parametri!$I$27)/1000+Parametri!K18/1000","v":1.5900000000000001E-3},{"$f":"(SUM(Calcolo!O29:O31)+Calcolo!O34+(Stampa!$G$47*'Acidi & concimi'!AQ33*1000000/(Parametri!$I$27*Parametri!$I$28))+SUM(Calcolo!O53:O55)+Calcolo!O71)*(Parametri!$I$27)/1000+Parametri!L18/1000","v":1.2977757409598532E-2},{"$f":"(SUM(Calcolo!P29:P31)+Calcolo!P34+(Stampa!$G$47*'Acidi & concimi'!AR33*1000000/(Parametri!$I$27*Parametri!$I$28))+SUM(Calcolo!P53:P55)+Calcolo!P71)*(Parametri!$I$27)/1000+Parametri!M18/1000","v":0.64360000000000006},{"$f":"(SUM(Calcolo!Q29:Q31)+Calcolo!Q34+(Stampa!$G$47*'Acidi & concimi'!AS33*1000000/(Parametri!$I$27*Parametri!$I$28))+SUM(Calcolo!Q53:Q55)+Calcolo!Q71)*(Parametri!$I$27)/1000+Parametri!N18/1000","v":7.1317378917378924E-2},{"$f":"(SUM(Calcolo!R29:R31)+Calcolo!R34+(Stampa!$G$47*'Acidi & concimi'!AT33*1000000/(Parametri!$I$27*Parametri!$I$28))+SUM(Calcolo!R53:R55)+Calcolo!R71)*(Parametri!$I$27)/1000+Parametri!O18/1000","v":1.7306300308660653E-3},{"$f":"(SUM(Calcolo!S29:S31)+Calcolo!S34+(Stampa!$G$47*'Acidi & concimi'!AU33*1000000/(Parametri!$I$27*Parametri!$I$28))+SUM(Calcolo!S53:S55)+Calcolo!S71)*(Parametri!$I$27)/1000+Parametri!P18/1000","v":2.523283996517401E-3},{"$f":"(SUM(Calcolo!T29:T31)+Calcolo!T34+(Stampa!$G$47*'Acidi & concimi'!AV33*1000000/(Parametri!$I$27*Parametri!$I$28))+SUM(Calcolo!T53:T55)+Calcolo!T71)*(Parametri!$I$27)/1000+Parametri!Q18/1000","v":0.30187722550474638},{"$f":"(SUM(Calcolo!U29:U31)+Calcolo!U34+(Stampa!$G$47*'Acidi & concimi'!AW33*1000000/(Parametri!$I$27*Parametri!$I$28))+SUM(Calcolo!U53:U55)+Calcolo!U71)*(Parametri!$I$27)/1000+Parametri!R18/1000","v":2.2924760492243561E-2}]
["p.m.",14.007,14.007,30.974,39.1,40.08,24.312000000000001,22.989799999999999,32.06,35.472999999999999,55.85,10.8,63.55,65.38,54.94,95.95]
[]
[]
[null,"Solución madre tanque B (g/L)"]
[null,"N-NO3","N-NH4","P-PO4","K","Ca","Mg","Na","S-SO4","Cl","Fe","B","Cu","Zn","Mn","Mo"]
["moles/L",{"$f":"(SUM(Calcolo!G24:G26)+SUM(Calcolo!G35:'Calcolo'!G36)+Calcolo!G39+SUM(Calcolo!G42:G43)+SUM(Calcolo!G49:G50)+(Stampa!$G$62*'Acidi & concimi'!AI33*1000000/(Parametri!$I$27*Parametri!$I$28))+SUM(Calcolo!G58:G69))*(Parametri!$I$27)/1000+Parametri!D18/1000","v":0.2420596561686828},{"$f":"(SUM(Calcolo!H24:H26)+SUM(Calcolo!H35:'Calcolo'!H36)+Calcolo!H39+SUM(Calcolo!H42:H43)+SUM(Calcolo!H49:H50)+(Stampa!$G$62*'Acidi & concimi'!AJ33*1000000/(Parametri!$I$27*Parametri!$I$28))+SUM(Calcolo!H58:H69))*(Parametri!$I$27)/1000+Parametri!E18/1000","v":0.14899950124837683},{"$f":"(SUM(Calcolo!I24:I26)+SUM(Calcolo!I35:'Calcolo'!I36)+Calcolo!I39+SUM(Calcolo!I42:I43)+SUM(Calcolo!I49:I50)+(Stampa!$G$62*'Acidi & concimi'!AK33*1000000/(Parametri!$I$27*Parametri!$I$28))+SUM(Calcolo!I58:I69))*(Parametri!$I$27)/1000+Parametri!F18/1000","v":9.9010000000000001E-2},{"$f":"(SUM(Calcolo!J24:J26)+SUM(Calcolo!J35:'Calcolo'!J36)+Calcolo!J39+SUM(Calcolo!J42:J43)+SUM(Calcolo!J49:J50)+(Stampa!$G$62*'Acidi & concimi'!AL33*1000000/(Parametri!$I$27*Parametri!$I$28))+SUM(Calcolo!J58:J69))*(Parametri!$I$27)/1000+Parametri!G18/1000","v":0.26666805541839328},{"$f":"(SUM(Calcolo!K24:K26)+SUM(Calcolo!K35:'Calcolo'!K36)+Calcolo!K39+SUM(Calcolo!K42:K43)+SUM(Calcolo!K49:K50)+(Stampa!$G$62*'Acidi & concimi'!AM33*1000000/(Parametri!$I$27*Parametri!$I$28))+SUM(Calcolo!K58:K69))*(Parametri!$I$27)/1000+Parametri!H18/1000","v":2.3999999999999998E-3},{"$f":"(SUM(Calcolo!L24:L26)+SUM(Calcolo!L35:'Calcolo'!L36)+Calcolo!L39+SUM(Calcolo!L42:L43)+SUM(Calcolo!L49:L50)+(Stampa!$G$62*'Acidi & concimi'!AN33*1000000/(Parametri!$I$27*Parametri!$I$28))+SUM(Calcolo!L58:L69))*(Parametri!$I$27)/1000+Parametri!I18/1000","v":2.8900000000000011E-3},{"$f":"(SUM(Calcolo!M24:M26)+SUM(Calcolo!M35:'Calcolo'!M36)+Calcolo!M39+SUM(Calcolo!M42:M43)+SUM(Calcolo!M49:M50)+(Stampa!$G$62*'Acidi & concimi'!AO33*1000000/(Parametri!$I$27*Parametri!$I$28))+SUM(Calcolo!M58:M69))*(Parametri!$I$27)/1000+Parametri!J18/1000","v":4.6999999999999999E-4},{"$f":"(SUM(Calcolo!N24:N26)+SUM(Calcolo!N35:'Calcolo'!N36)+Calcolo!N39+SUM(Calcolo!N42:N43)+SUM(Calcolo!N49:N50)+(Stampa!$G$62*'Acidi & concimi'!AP33*1000000/(Parametri!$I$27*Parametri!$I$28))+SUM(Calcolo!N58:N69))*(Parametri!$I$27)/1000+Parametri!K18/1000","v":3.9882455086924916E-2},{"$f":"(SUM(Calcolo!O24:O26)+SUM(Calcolo!O35:'Calcolo'!O36)+Calcolo!O39+SUM(Calcolo!O42:O43)+SUM(Calcolo!O49:O50)+(Stampa!$G$62*'Acidi & concimi'!AQ33*1000000/(Parametri!$I$27*Parametri!$I$28))+SUM(Calcolo!O58:O69))*(Parametri!$I$27)/1000+Parametri!L18/1000","v":2.99E-3},{"$f":"(SUM(Calcolo!P24:P26)+SUM(Calcolo!P35:'Calcolo'!P36)+Calcolo!P39+SUM(Calcolo!P42:P43)+SUM(Calcolo!P49:P50)+(Stampa!$G$62*'Acidi & concimi'!AR33*1000000/(Parametri!$I$27*Parametri!$I$28))+SUM(Calcolo!P58:P69))*(Parametri!$I$27)/1000+Parametri!M18/1000","v":3.5999999999999999E-3},{"$f":"(SUM(Calcolo!Q24:Q26)+SUM(Calcolo!Q35:'Calcolo'!Q36)+Calcolo!Q39+SUM(Calcolo!Q42:Q43)+SUM(Calcolo!Q49:Q50)+(Stampa!$G$62*'Acidi & concimi'!AS33*1000000/(Parametri!$I$27*Parametri!$I$28))+SUM(Calcolo!Q58:Q69))*(Parametri!$I$27)/1000+Parametri!N18/1000","v":2.0399999999999998E-2},{"$f":"(SUM(Calcolo!R24:R26)+SUM(Calcolo!R35:'Calcolo'!R36)+Calcolo!R39+SUM(Calcolo!R42:R43)+SUM(Calcolo!R49:R50)+(Stampa!$G$62*'Acidi & concimi'!AT33*1000000/(Parametri!$I$27*Parametri!$I$28))+SUM(Calcolo!R58:R69))*(Parametri!$I$27)/1000+Parametri!O18/1000","v":0},{"$f":"(SUM(Calcolo!S24:S26)+SUM(Calcolo!S35:'Calcolo'!S36)+Calcolo!S39+SUM(Calcolo!S42:S43)+SUM(Calcolo!S49:S50)+(Stampa!$G$62*'Acidi & concimi'!AU33*1000000/(Parametri!$I$27*Parametri!$I$28))+SUM(Calcolo!S58:S69))*(Parametri!$I$27)/1000+Parametri!P18/1000","v":0},{"$f":"(SUM(Calcolo!T24:T26)+SUM(Calcolo!T35:'Calcolo'!T36)+Calcolo!T39+SUM(Calcolo!T42:T43)+SUM(Calcolo!T49:T50)+(Stampa!$G$62*'Acidi & concimi'!AV33*1000000/(Parametri!$I$27*Parametri!$I$28))+SUM(Calcolo!T58:T69))*(Parametri!$I$27)/1000+Parametri!Q18/1000","v":1.6000000000000001E-3},{"$f":"(SUM(Calcolo!U24:U26)+SUM(Calcolo!U35:'Calcolo'!U36)+Calcolo!U39+SUM(Calcolo!U42:U43)+SUM(Calcolo!U49:U50)+(Stampa!$G$62*'Acidi & concimi'!AW33*1000000/(Parametri!$I$27*Parametri!$I$28))+SUM(Calcolo!U58:U69))*(Parametri!$I$27)/1000+Parametri!R18/1000","v":0}]
["p.m.",14.007,14.007,30.974,39.1,40.08,24.312000000000001,22.989799999999999,32.06,35.472999999999999,55.85,10.8,63.55,65.38,54.94,95.95]
[]
[]
[null,"Comprobar precipitados en el Tanque A"]
[null,null,"PM","Solubilidad","Producto de solubilidad",null,"Kps","Kps calculado"]
[null,"KNO3",101.1,133,"[K+]*[N03-]=s2",null,{"$f":"((D24/C24)^2)","v":1.7306170208810894},{"$f":"E12*B12","v":0.15565755167605022},{"$f":"IF(H24>G24,B24,0)","v":0},{"$f":"IF(H24>G24,\"La relación de dilución es demasiado alta\",\" \")","v":" "},null,null,null,null,null,null,null,null,null,null,null,null,{"$f":"IF(H24>G24,1,\" \")","v":" "}]
[null,"KCl",74.55,344,"[K+]*[Cl-]= s2",null,{"$f":"((D25/C25)^2)","v":21.292251609365568},{"$f":"E12*J12","v":5.0502458380949668E-3},{"$f":"IF(H25>G25,B25,0)","v":0},{"$f":"IF(H25>G25,\"La relación de dilución es demasiado alta\",\" \")","v":" "},null,null,null,null,null,null,null,null,null,null,null,null,{"$f":"IF(H25>G25,1,\" \")","v":" "}]
[null,"CaNO3",164.09,1212,"[Ca]*[NO3-]2=4s2",null,{"$f":"((D26/C26)^3)*4","v":1611.8384286005539},{"$f":"F12*B12^2","v":1.9839756616767865E-3},0,{"$f":"IF(H26>G26,\"La relación de dilución es demasiado alta\",\" \")","v":" "},null,null,null,null,null,null,null,null,null,null,null,null," "]
[null,"CaCl2",110.99,745,"[Ca]*[Cl-]2=4s3",null,{"$f":"((D27/C27)^3)*4","v":1209.6988154636736},{"$f":"F12*J12^2","v":2.0884351235416287E-6},0,{"$f":"IF(H27>G27,\"La relación de dilución es demasiado alta\",\" \")","v":" "},null,null,null,null,null,null,null,null,null,null,null,null," "]
[null,"Ca(H2PO4)2*H2O",252.07,18,"Ca(H2PO4)2=4s2",null,{"$f":"((D28/C28)^3)*4","v":1.456511850459744E-3},{"$f":"F12*D12^2","v":1.2399999999999988E-12},0,{"$f":"IF(H28>G28,\"La relación de dilución es demasiado alta\",\" \")","v":" "},null,null,null,null,null,null,null,null,null,null,null,null," "]
[null,"CaSO4",136.13999999999999,2.09,"CaSO4=s2",null,{"$f":"((D29/C29)^2)","v":2.3567910469198086E-4},{"$f":"F12*I12","v":1.9715999999999979E-5},0,{"$f":"IF(H29>G29,\"La relación de dilución es demasiado alta , o esta utilizando sales que contienen sulfatos\",\" \")","v":" "},null,null,null,null,null,null,null,null,null,null,null,null," "]
[null,"NH4NO3",80.040000000000006,1183,"[NH4+]*[NO3-]= s2",null,{"$f":"((D30/C30)^2)","v":218.45164998710038},{"$f":"C12*B12","v":4.0019704595807966E-4},0,{"$f":"IF(H30>G30,\"La relación de dilución es demasiado alta \",\" \")","v":" "},null,null,null,null,null,null,null,null,null,null,null,null," "]
[null,"NH4Cl",53.49,29.7,"[NH4+]*[Cl-]= s2",null,{"$f":"((D31/C31)^2)","v":0.30829586714936263},{"$f":"C12*J12","v":1.2984230087171937E-5},0,{"$f":"IF(H31>G31,\"La relación de dilución es demasiado alta\",\" \")","v":" "},null,null,null,null,null,null,null,null,null,null,null,null," "]
[null,"NaNO3",84.99,921,"[Na+]*[NO3-]= s2",null,{"$f":"((D32/C32)^2)","v":117.43122786771661},{"$f":"H12*B12","v":1.87998846870263E-4},0,{"$f":"IF(H32>G32,\"La relación de dilución es demasiado alta\",\" \")","v":" "},null,null,null,null,null,null,null,null,null,null,null,null," "]
[null,"NaCl",55.44,357,"[Na+]*[Cl-]= s2",null,{"$f":"((D33/C33)^2)","v":41.465794306703401},{"$f":"H12*J12","v":6.0995459825113097E-6},0,{"$f":"IF(H33>G33,\"La relación de dilución es demasiado alta\",\" \")","v":" "},null,null,null,null,null,null,null,null,null,null,null,null," "]
[null,"Fe(NO3)2*6H2O",287.95,835,"[Fe2+]*[2NO3-]2=4s3",null,{"$f":"((D34/C34)^3)*4","v":97.536725006342365},{"$f":"K12*(B12)^2","v":0.10297473676251463},0,{"$f":"IF(H34>G34,\"La relación de dilución es demasiado alta\",\" \")","v":" "},null,null,null,null,null,null,null,null,null,null,null,null," "]
[null,"Fe(Cl)2",126.75,644,"[Fe2+]*[2Cl-]2=4s3",null,{"$f":"((D35/C35)^3)*4","v":524.65484695689963},{"$f":"K12*(J12)^2","v":1.0839651979930596E-4},0,{"$f":"IF(H35>G35,\"La relación de dilución es demasiado alta\",\" \")","v":" "},null,null,null,null,null,null,null,null,null,null,null,null," "]
[null,null,null,null,null,null,null,"Hay",{"$f":"SUM(W24:W35)","v":0},"sales precipitadas"]
[]
[]
[null,"Comprobar precipitados en el Tanque B"]
[null,null,"PM","Solubilidad","Producto de solubilidad",null,"Kps","Calculated Kps"]
[null,"CaNO3",164.09,1212,"[Ca]*[NO3-]2=4s2",null,{"$f":"((D41/C41)^3)*4","v":1611.8384286005539},{"$f":"F18*B18^2","v":1.4062290514680223E-4},{"$f":"IF(H41>G41,B41,0)","v":0},{"$f":"IF(H41>G41,\"La relación de dilución es demasiado alta\",\" \")","v":" "},null,null,null,null,null,null,null,null,null,null,null,null,{"$f":"IF(H41>G41,1,\" \")","v":" "}]
[null,"CaCl2",110.99,745,"[Ca]*[Cl-]2=4s3",null,{"$f":"((D42/C42)^3)*4","v":1209.6988154636736},{"$f":"F18*J18^2","v":2.1456240000000001E-8},0,{"$f":"IF(H42>G42,\"La relación de dilución es demasiado alta\",\" \")","v":" "},null,null,null,null,null,null,null,null,null,null,null,null," "]
[null,"Ca(H2PO4)2",252.07,18,"Ca(H2PO4)2=4s2",null,{"$f":"((D43/C43)^3)*4","v":1.456511850459744E-3},{"$f":"F18*D18^2","v":2.3527152239999999E-5},0,{"$f":"IF(H43>G43,\"La relación de dilución es demasiado alta, o la precipitación se debe al Calcio del agua de riego\",\" \")","v":" "},null,null,null,null,null,null,null,null,null,null,null,null," "]
[null,"CaSO4",136.13999999999999,2.09,"CaSO4=s2",null,{"$f":"((D44/C44)^2)","v":2.3567910469198086E-4},{"$f":"F18*I18","v":9.5717892208619789E-5},0,{"$f":"IF(H44>G44,\"La relación de dilución es demasiado alta, o la precipitación se debe al Calcio del agua de riego\",\" \")","v":" "},null,null,null,null,null,null,null,null,null,null,null,null," "]
[null,"KNO3",101.1,133,"[K+]*[N03-]=s2",null,{"$f":"((D45/C45)^2)","v":1.7306170208810894},{"$f":"E18*B18","v":6.4549577805747521E-2},0,{"$f":"IF(H45>G45,\"La relación de dilución es demasiado alta\",\" \")","v":" "},null,null,null,null,null,null,null,null,null,null,null,null," "]
[null,"KH2PO4",136.09,133,"[K+]*[H2PO4-]=s2",null,{"$f":"((D46/C46)^2)","v":0.95510441757741793},{"$f":"E18*D18","v":2.640280416697512E-2},0," ",null,null,null,null,null,null,null,null,null,null,null,null," "]
[null,"K2SO4",174.25,120,"[2K+]2*[SO42-]=4s3",null,{"$f":"((D47/C47)^3)*4","v":1.3064276670623456},{"$f":"I18*(E18^2)","v":2.8361152347889289E-3},0," ",null,null,null,null,null,null,null,null,null,null,null,null," "]
[null,"KCl",74.55,344,"[K+]*[Cl-]= s2",null,{"$f":"((D48/C48)^2)","v":21.292251609365568},{"$f":"E18*J18","v":7.9733748570099587E-4},0," ",null,null,null,null,null,null,null,null,null,null,null,null," "]
[null,"K2B4O7*8H2O ",377.55,267,"[2K+]2*[B4O72-]= 4s3",null,{"$f":"((D49/C49)^3)*4","v":1.4147195386833589},{"$f":"E18^2*(L18/4)","v":3.6267044408119906E-4},0," ",null,null,null,null,null,null,null,null,null,null,null,null," "]
[null,"K2MoO4",238.13,1846,"[2K+]2*[MoO42-]=4s3",null,{"$f":"((D50/C50)^3)*4","v":1863.4285515771528},{"$f":"E18^2*P18","v":0},0," ",null,null,null,null,null,null,null,null,null,null,null,null," "]
[null,"(NH4)NO3",80.040000000000006,1183,"[NH4+]*[NO3-]= s2",null,{"$f":"((D51/C51)^2)","v":218.45164998710038},{"$f":"C18*B18","v":3.606676804148732E-2},0," ",null,null,null,null,null,null,null,null,null,null,null,null," "]
[null,"(NH4)H2PO4",83.03,1710,"[(NH4)+]*[H2PO4-]=s2",null,{"$f":"((D52/C52)^2)","v":424.15261115678453},{"$f":"C18*D18","v":1.475244061860179E-2},0," ",null,null,null,null,null,null,null,null,null,null,null,null," "]
[null,"(NH4)2SO4",132.13999999999999,706,"[2NH4+]2*[SO42-]=4s3",null,{"$f":"((D53/C53)^3)*4","v":610.05808490777599},{"$f":"C18^2*I18","v":8.8542445774585608E-4},0," ",null,null,null,null,null,null,null,null,null,null,null,null," "]
[null,"NH4Cl",53.49,29.7,"[(NH4)+]*[Cl-]= s2",null,{"$f":"((D54/C54)^2)","v":0.30829586714936263},{"$f":"C18*J18","v":4.4550850873264673E-4},0," ",null,null,null,null,null,null,null,null,null,null,null,null," "]
[null,"(NH4)2B4O7*4H2O",263.37,72.7,"[2(NH4)+]2*[(B4O7*4H2O)2-]=4s3",null,{"$f":"((D55/C55)^3)*4","v":8.4132600442882663E-2},{"$f":"C18^2*(L18/4)","v":1.1322434199855172E-4},0," ",null,null,null,null,null,null,null,null,null,null,null,null," "]
[null,"(NH4)6Mo7O24*4H2O",1235.8599999999999,430,"[6(NH4)+]6*[(Mo7O24*4H2O)6-]=36s7",null,{"$f":"((D56/C56)^7)*36","v":2.2222696629124863E-2},{"$f":"C18^6*P18/7","v":0},0," ",null,null,null,null,null,null,null,null,null,null,null,null," "]
[null,"Mg(NO3)2*2H2O",184.35,260,"[Mg2+]*[2(NO3-)*2H2O]2=4s3",null,{"$f":"((D57/C57)^3)*4","v":11.221492135162906},{"$f":"G18*B18^2","v":1.6933341494760777E-4},0," ",null,null,null,null,null,null,null,null,null,null,null,null," "]
[null,"MgSO4",120.36,260,"[Mg2+]*[SO42-]=s2",null,{"$f":"((D58/C58)^2)","v":4.6664040226722072},{"$f":"G18*I18","v":1.1526029520121305E-4},0," ",null,null,null,null,null,null,null,null,null,null,null,null," "]
[null,"Mg(Cl)2",95.21,542.5,"[Mg2+]*[2Cl-]2=4s3",null,{"$f":"((D59/C59)^3)*4","v":739.96558804196036},{"$f":"G18*J18^2","v":2.5836889000000013E-8},0," ",null,null,null,null,null,null,null,null,null,null,null,null," "]
[null,"Mg(MoO4)2",184.24,137,"[Mg]*[2MoO4-]2=4s3",null,{"$f":"((D60/C60)^3)*4","v":1.6446364751858393},{"$f":"G18*P18^2","v":0},0," ",null,null,null,null,null,null,null,null,null,null,null,null," "]
[null,"Cu(NO3)2*3H2O",241.6,137.80000000000001,"[Cu2+]*[(2NO3-)*3H2O]2",null,{"$f":"((D61/C61)^3)*4","v":0.74219300036872482},{"$f":"M18*B18^2","v":0},0," ",null,null,null,null,null,null,null,null,null,null,null,null," "]
[null,"CuSO4",159.6,143,"[Cu2+]*[SO42-]=s2",null,{"$f":"((D62/C62)^2)","v":0.80279803518822113},{"$f":"M18*I18","v":0},0," ",null,null,null,null,null,null,null,null,null,null,null,null," "]
[null,"Cu(Cl)2",134.44999999999999,706,"[Cu2+]*[2Cl-]2=4s3",null,{"$f":"((D63/C63)^3)*4","v":579.15081896306583},{"$f":"M18*J18^2","v":0},0," ",null,null,null,null,null,null,null,null,null,null,null,null," "]
[null,"Mn(H2PO4)2*2H2O",284.94,100,"[Mn2+]*[2(H2PO4-)*2H2O]2=4s3",null,{"$f":"((D64/C64)^3)*4","v":0.17290188635098455},{"$f":"O18*D18^2","v":1.5684768160000002E-5},0," ",null,null,null,null,null,null,null,null,null,null,null,null," "]
[null,"MnSO4",151,520,"[Mn2+]*[SO42-]=s2",null,{"$f":"((D65/C65)^2)","v":11.859128985570807},{"$f":"O18*I18","v":6.3811928139079864E-5},0," ",null,null,null,null,null,null,null,null,null,null,null,null," "]
[null,"Mn(Cl)2*4H2O",197.91,1510,"[Mn2+]*[2Cl-*4H2O]2=4s3",null,{"$f":"((D66/C66)^3)*4","v":1776.5916508924176},{"$f":"O18*J18^2","v":1.4304160000000002E-8},0," ",null,null,null,null,null,null,null,null,null,null,null,null," "]
[null,"Zn(NO3)2*6H2O",297.48,1843,"[Zn2+]*[2NO3-]2=4s3",null,{"$f":"((D67/C67)^3)*4","v":951.17993107832763},{"$f":"N18*B18^2","v":0},0," ",null,null,null,null,null,null,null,null,null,null,null,null," "]
[null,"Zn(H2PO4)2*2H2O",295.39,250,"[Zn2+]*[(2H2PO4-)*2H2O]2=4s3",null,{"$f":"((D68/C68)^3)*4","v":2.4248933968089017},{"$f":"N18*D18^2","v":0},0," ",null,null,null,null,null,null,null,null,null,null,null,null," "]
[null,"ZnSO4*7H2O",287.54000000000002,965,"[Zn2+]*[(SO42-)*7H2O]=s2",null,{"$f":"((D69/C69)^2)","v":11.263103886150802},{"$f":"N18*I18","v":0},0," ",null,null,null,null,null,null,null,null,null,null,null,null," "]
[null,"Zn(Cl)2",136.29,4320,"[Zn2+]*[2Cl-]2=4s3",null,{"$f":"((D70/C70)^3)*4","v":127385.28327031071},{"$f":"N18*J18^2","v":0},0,{"$f":"IF(H70>G70,\"The dilution ratio is too high\",\" \")","v":" "},null,null,null,null,null,null,null,null,null,null,null,null," "]
[null,null,null,null,null,null,"Hay",null,{"$f":"SUM(W41:W70)","v":0},"sales precipitadas"]

{"sheet":"Convertitore","index":8,"n_rows":17,"n_cols":17,"rows_kept":17,"cut":false,"hidden":false,"merged":[[15,1,15,10],[15,11,15,16],[1,8,1,11],[1,13,1,16],[3,8,3,11],[3,13,3,16],[5,8,5,11],[5,13,5,16]]}
[]
[null,"Conversor de unidades (ppm a mM)",null,null,null,null,null,null,"Guía rápida de inicio",null,null,null,null,"Cálculo"]
[]
[null,null,null,null,null,null,null,null,"Soluciones nutritivas",null,null,null,null,"Fertilizantes y ácidos"]
[]
[null,null,null,null,null,null,null,null,"Informe",null,null,null,null,"Entrada"]
[]
[]
[]
[null,"Para convertir ppm en mM (macroelementos) o µM (Fe, Zn, Mn, Cu, B, Mo) insertar el valor ppm en la celda amarilla."]
[null,"Los resultados de la conversión se muestran en las celdas verdes."]
[]
[null,"HCO3-","N-NO3","N-NH4","P-PO4","K","Ca","Mg","Na","S-SO4","Cl","Fe","B","Cu","Zn","Mn","Mo"]
["ppm",259,0,0,0,0,48,35,89,0,130]
["PM",61,14.007,14.007,30.974,39.1,40.08,24.312000000000001,22.989799999999999,32.06,35.472999999999999,55.85,10.8,63.55,65.38,54.94,95.95]
[null,"millimoles/L",null,null,null,null,null,null,null,null,null,"micromoles/L"]
[null,{"$f":"B14/B15","v":4.2459016393442619},{"$f":"C14/C15","v":0},0,0,0,1.1976047904191618,1.4396182954919381,3.871282046820764,0,3.6647591125644858,{"$f":"L14/L15*1000","v":0},0,0,0,0,0]